program: Orca
programVersion: 5.0.2
elementType: O O O C C C C C C C C C C C C C C C C C C C C C C H H H H H H H H H H H H H H H H H H H H H H H H H H
charge: 0
multiplicity: 1
keywords: wb97x-d3
keywords: def2-TZVPP
keywords: def2/J RIJCOSX
keywords: DEFGRID2
keywords: scfconv7
keywords: smallprint printgap noloewdin
keywords: NOSOSCF
formula: C22H26O3
InChI: InChI=1/C22H26O3/c1-15(2)10-19-20(22(19,3)4)21(23)25-14-17-12-18(24-13-17)11-16-8-6-5-7-9-16/h5-10,12-13,19-20H,11,14H2,1-4H3
51 atoms
O  1.343741 -1.423121 -1.215337
O  2.219954 -1.695729 0.825839
O  -2.048288 -2.367368 1.357951
C  1.624175 1.583354 -0.26572
C  2.389972 1.233772 -1.501821
C  2.542451 0.373792 -0.269183
C  2.082293 2.747443 0.579448
C  0.125557 1.39797 -0.256574
C  3.531608 2.054552 -1.983796
C  2.029975 -1.009476 -0.143114
C  4.627738 1.571217 -2.570203
C  5.723386 2.475211 -3.048475
C  4.855932 0.109815 -2.809018
C  0.647007 -2.668242 -1.094769
C  -0.612825 -2.492061 -0.326299
C  -1.844281 -1.936555 -0.798953
C  -0.806589 -2.727253 0.992413
C  -2.676318 -1.88124 0.266999
C  -4.04565 -1.336617 0.453984
C  -4.035269 -0.088595 1.306207
C  -3.469338 1.084378 0.815654
C  -4.550251 -0.094926 2.595043
C  -3.421616 2.227061 1.59643
C  -4.503888 1.048306 3.381709
C  -3.939635 2.211931 2.884666
H  1.787323 0.78966 -2.28936
H  3.455995 0.509318 0.299101
H  3.167337 2.850347 0.593072
H  1.748147 2.624628 1.610858
H  1.664317 3.68491 0.205948
H  -0.3620 2.321614 -0.576819
H  -0.239579 1.163648 0.744999
H  -0.208516 0.604018 -0.921093
H  3.440908 3.131328 -1.870319
H  6.671282 2.231992 -2.561399
H  5.888131 2.360358 -4.122775
H  5.505251 3.524468 -2.852929
H  5.782326 -0.222653 -2.333382
H  4.045224 -0.514727 -2.439934
H  4.969329 -0.089489 -3.877987
H  1.287543 -3.424397 -0.639701
H  0.439999 -2.971468 -2.120535
H  -2.071739 -1.614461 -1.803101
H  -0.160846 -3.11648 1.762026
H  -4.699644 -2.089394 0.90248
H  -4.458523 -1.116896 -0.532805
H  -3.051811 1.098886 -0.184679
H  -4.987599 -1.003028 2.992361
H  -2.978021 3.131188 1.199755
H  -4.905981 1.026318 4.386183
H  -3.900809 3.103057 3.497142
totalener: -1079.72861354 hartree
nucrepener: 2157.73251364 hartree
electener: -3237.46112718 hartree
oneelecener: -5753.72407765 hartree
twoeener: 2516.26295047 hartree
kineticenergy: 1074.91675207 hartree
xcener: -106.467397123874 hartree
chargesum: -0.0000000
charge: -0.266270 -0.368835 -0.247206 0.157668 0.016103 -0.121265 -0.285439 -0.297477 -0.261217 0.343269 -0.004807 -0.211799 -0.221440 0.034420 -0.047925 -0.353501 0.008731 0.251646 -0.128625 0.093013 -0.196449 -0.144526 -0.119340 -0.121568 -0.130157 0.099125 0.089256 0.085550 0.096761 0.086624 0.086902 0.112784 0.080398 0.092506 0.085638 0.085468 0.078050 0.086464 0.076614 0.088647 0.113746 0.100288 0.130433 0.150457 0.096409 0.109196 0.116669 0.104914 0.122027 0.123550 0.124523
qa: -0.2663 -0.3688 -0.2472 0.1577 0.0161 -0.1213 -0.2854 -0.2975 -0.2612 0.3433 -0.0048 -0.2118 -0.2214 0.0344 -0.0479 -0.3535 0.0087 0.2516 -0.1286 0.0930 -0.1964 -0.1445 -0.1193 -0.1216 -0.1302 0.0991 0.0893 0.0855 0.0968 0.0866 0.0869 0.1128 0.0804 0.0925 0.0856 0.0855 0.0780 0.0865 0.0766 0.0886 0.1137 0.1003 0.1304 0.1505 0.0964 0.1092 0.1167 0.1049 0.1220 0.1236 0.1245
va: 2.0824 2.1323 2.3163 3.7683 3.7718 3.8370 3.9067 3.9092 3.9085 4.2082 3.7381 3.9423 3.9376 3.8991 3.6514 4.0159 3.9866 3.5838 3.8767 3.6171 3.9865 4.0104 3.9508 3.9622 3.9672 1.0234 1.0288 1.0052 1.0057 1.0008 1.0008 0.9939 1.0137 1.0097 0.9992 0.9984 1.0099 1.0019 1.0251 1.0013 1.0099 0.9947 1.0165 1.0126 1.0118 1.0066 1.0035 1.0120 1.0016 1.0005 0.9996
dispcorr: -0.026140249 hartree
energy: -1079.754753792665
dipole: 16.93109 -17.26172 -0.33063 16.72461 -16.32788 0.39674 -10.39626 9.67053 -0.72573
magnitude: 0.89073 au
magnitude: 2.26406 debye
