program: Orca
programVersion: 5.0.2
elementType: O O O C C C C C C C C C C C C C C C C C C C C C C H H H H H H H H H H H H H H H H H H H H H H H H H H
charge: 0
multiplicity: 1
keywords: wb97x-d3
keywords: def2-TZVPP
keywords: def2/J RIJCOSX
keywords: DEFGRID2
keywords: scfconv7
keywords: smallprint printgap noloewdin
keywords: NOSOSCF
formula: C22H26O3
InChI: InChI=1/C22H26O3/c1-15(2)10-19-20(22(19,3)4)21(23)25-14-17-12-18(24-13-17)11-16-8-6-5-7-9-16/h5-10,12-13,19-20H,11,14H2,1-4H3
51 atoms
O  1.415285 -2.202035 -1.262775
O  2.04418 -1.971715 0.872483
O  -2.148523 -3.247623 1.288197
C  3.482881 0.629939 -0.113011
C  2.089639 0.992533 0.29606
C  2.30936 -0.153324 -0.667715
C  4.19568 1.504772 -1.116512
C  4.40941 0.026505 0.913925
C  1.377208 2.207166 -0.178775
C  1.939241 -1.518265 -0.234973
C  1.630526 3.455113 0.218003
C  0.833661 4.613218 -0.302512
C  2.704936 3.80747 1.20063
C  0.74627 -3.42211 -0.954722
C  -0.509259 -3.152866 -0.201473
C  -1.423086 -2.079795 -0.444642
C  -1.003401 -3.818452 0.86533
C  -2.389569 -2.181356 0.497344
C  -3.591663 -1.356808 0.802077
C  -3.490556 0.020891 0.201462
C  -2.518657 0.912445 0.650431
C  -4.353748 0.430131 -0.806126
C  -2.418922 2.183323 0.109614
C  -4.256675 1.703243 -1.352952
C  -3.290363 2.583847 -0.89525
H  1.822544 0.663044 1.297844
H  2.074694 0.058828 -1.705396
H  3.514774 1.946792 -1.842736
H  4.943657 0.926902 -1.662315
H  4.713083 2.324399 -0.613806
H  3.887532 -0.575312 1.652819
H  4.940329 0.823698 1.438989
H  5.160414 -0.60605 0.437307
H  0.568697 2.046238 -0.886745
H  0.078239 4.298968 -1.022345
H  0.328184 5.141651 0.509904
H  1.479196 5.345814 -0.793433
H  3.41843 4.509244 0.761592
H  2.279572 4.307452 2.074601
H  3.258962 2.93846 1.550349
H  1.39625 -4.105664 -0.40375
H  0.536108 -3.86738 -1.927908
H  -1.35285 -1.317281 -1.203199
H  -0.649215 -4.668954 1.42469
H  -3.70616 -1.280548 1.887729
H  -4.497157 -1.853384 0.439359
H  -1.826406 0.605461 1.425424
H  -5.111369 -0.253362 -1.170653
H  -1.655821 2.859807 0.472521
H  -4.93959 2.004485 -2.13647
H  -3.215307 3.577494 -1.317492
totalener: -1079.72899557 hartree
nucrepener: 2187.68084369 hartree
electener: -3267.40983926 hartree
oneelecener: -5813.69936128 hartree
twoeener: 2546.28952202 hartree
kineticenergy: 1074.91231220 hartree
xcener: -106.468830830117 hartree
chargesum: 0.0000000
charge: -0.273015 -0.377388 -0.254537 0.071516 -0.037400 -0.068124 -0.250541 -0.259577 -0.209947 0.330385 -0.009323 -0.238993 -0.252122 0.082971 -0.040925 -0.279860 -0.022978 0.185981 -0.070081 0.031848 -0.181731 -0.143069 -0.131135 -0.111397 -0.144200 0.106869 0.080841 0.084838 0.098452 0.081648 0.105165 0.076294 0.087141 0.103723 0.077409 0.091707 0.097528 0.089687 0.097921 0.086364 0.099880 0.100784 0.141653 0.133635 0.105192 0.084477 0.120875 0.107220 0.148582 0.123376 0.122382
qa: -0.2730 -0.3774 -0.2545 0.0715 -0.0374 -0.0681 -0.2505 -0.2596 -0.2099 0.3304 -0.0093 -0.2390 -0.2521 0.0830 -0.0409 -0.2799 -0.0230 0.1860 -0.0701 0.0318 -0.1817 -0.1431 -0.1311 -0.1114 -0.1442 0.1069 0.0808 0.0848 0.0985 0.0816 0.1052 0.0763 0.0871 0.1037 0.0774 0.0917 0.0975 0.0897 0.0979 0.0864 0.0999 0.1008 0.1417 0.1336 0.1052 0.0845 0.1209 0.1072 0.1486 0.1234 0.1224
va: 2.1158 2.1229 2.3056 3.7705 3.8311 3.8213 3.9033 3.9000 3.8546 4.2303 3.6767 3.9408 3.9390 3.8970 3.7073 3.9916 3.9904 3.6656 3.8401 3.6729 3.9918 3.9738 3.8979 3.9643 3.9688 1.0243 1.0355 1.0066 1.0064 1.0026 1.0248 1.0029 1.0033 1.0027 1.0096 0.9939 1.0031 0.9978 1.0043 1.0098 1.0072 0.9838 1.0129 1.0085 1.0063 1.0068 1.0102 1.0115 0.9788 1.0004 1.0022
dispcorr: -0.026510669 hartree
energy: -1079.755506237770
dipole: 16.66220 -16.72761 -0.06541 24.42764 -23.82507 0.60257 -0.84753 0.34934 -0.49819
magnitude: 0.78457 au
magnitude: 1.99423 debye
