program: Orca
programVersion: 5.0.2
elementType: O O O C C C C C C C C C C C C C C C C C C C C C C H H H H H H H H H H H H H H H H H H H H H H H H H H
charge: 0
multiplicity: 1
keywords: wb97x-d3
keywords: def2-TZVPP
keywords: def2/J RIJCOSX
keywords: DEFGRID2
keywords: scfconv7
keywords: smallprint printgap noloewdin
keywords: NOSOSCF
formula: C22H26O3
InChI: InChI=1/C22H26O3/c1-15(2)10-19-20(22(19,3)4)21(23)25-14-17-12-18(24-13-17)11-16-8-6-5-7-9-16/h5-10,12-13,19-20H,11,14H2,1-4H3
51 atoms
O  1.214564 -0.064837 1.056565
O  2.238505 -1.625017 -0.177321
O  -2.028235 -2.708583 -0.325912
C  2.654065 0.834486 -2.102081
C  3.923764 0.493786 -1.39784
C  2.660642 0.69311 -0.587971
C  2.46055 2.24155 -2.616538
C  1.991516 -0.209142 -2.967478
C  5.049114 1.458195 -1.290543
C  2.037319 -0.465949 0.085336
C  5.869724 1.572334 -0.245356
C  6.995795 2.561055 -0.240317
C  5.748768 0.737354 0.992254
C  0.500904 -1.084274 1.763914
C  -0.697407 -1.547384 1.014102
C  -1.997658 -0.949128 1.013006
C  -0.784104 -2.607102 0.176398
C  -2.763305 -1.696447 0.18467
C  -4.187082 -1.605033 -0.242165
C  -4.891212 -0.477613 0.460985
C  -4.835914 0.816221 -0.0454
C  -5.572818 -0.700763 1.651746
C  -5.4502 1.865123 0.621836
C  -6.191492 0.344564 2.321009
C  -6.131447 1.631313 1.807305
H  4.21574 -0.550182 -1.485422
H  2.578681 1.626859 -0.04333
H  2.896814 2.351848 -3.611729
H  2.917691 2.990563 -1.969831
H  1.397879 2.476197 -2.695892
H  2.380417 -0.141256 -3.985341
H  0.912743 -0.049069 -3.015326
H  2.1636 -1.222447 -2.61392
H  5.225634 2.095279 -2.152769
H  7.033676 3.145026 -1.159119
H  6.903122 3.257208 0.597192
H  7.959335 2.059356 -0.121652
H  5.575287 1.365831 1.86959
H  4.944381 0.007392 0.937559
H  6.678336 0.194563 1.180461
H  0.203941 -0.613634 2.700528
H  1.163532 -1.918011 1.999571
H  -2.315686 -0.078952 1.564129
H  -0.062625 -3.338508 -0.148128
H  -4.696552 -2.551518 -0.037052
H  -4.241117 -1.46341 -1.326495
H  -4.302821 1.004867 -0.969728
H  -5.617311 -1.702988 2.06104
H  -5.398506 2.866142 0.214081
H  -6.721302 0.153106 3.244949
H  -6.614025 2.448111 2.327591
totalener: -1079.73297072 hartree
nucrepener: 2069.57222841 hartree
electener: -3149.30519913 hartree
oneelecener: -5577.51782984 hartree
twoeener: 2428.21263070 hartree
kineticenergy: 1074.91065641 hartree
xcener: -106.467084387386 hartree
chargesum: -0.0000000
charge: -0.261420 -0.404869 -0.255192 0.128202 -0.024030 -0.111693 -0.276127 -0.259256 -0.234647 0.354249 -0.007166 -0.210095 -0.226451 0.061878 -0.094924 -0.237550 0.004849 0.160301 -0.050955 0.021203 -0.160349 -0.151678 -0.122903 -0.124017 -0.126803 0.105318 0.084543 0.089457 0.084858 0.091154 0.083316 0.086885 0.099305 0.092938 0.078089 0.083781 0.086173 0.086143 0.083202 0.089557 0.101568 0.111983 0.137916 0.150295 0.091570 0.093898 0.112087 0.109658 0.125265 0.125025 0.125457
qa: -0.2614 -0.4049 -0.2552 0.1282 -0.0240 -0.1117 -0.2761 -0.2593 -0.2346 0.3542 -0.0072 -0.2101 -0.2265 0.0619 -0.0949 -0.2376 0.0048 0.1603 -0.0510 0.0212 -0.1603 -0.1517 -0.1229 -0.1240 -0.1268 0.1053 0.0845 0.0895 0.0849 0.0912 0.0833 0.0869 0.0993 0.0929 0.0781 0.0838 0.0862 0.0861 0.0832 0.0896 0.1016 0.1120 0.1379 0.1503 0.0916 0.0939 0.1121 0.1097 0.1253 0.1250 0.1255
va: 2.1304 2.0924 2.3054 3.7443 3.8238 3.8360 3.9095 3.9016 3.8951 4.1912 3.7359 3.9417 3.9422 3.8680 3.6991 4.0107 3.9656 3.7093 3.8625 3.6711 3.9771 3.9862 3.9573 3.9613 3.9534 1.0265 1.0321 1.0011 1.0050 1.0064 1.0026 1.0017 1.0218 1.0094 1.0099 0.9993 0.9988 1.0010 1.0177 1.0017 0.9940 1.0104 1.0080 1.0143 1.0094 1.0054 1.0108 1.0111 1.0003 1.0004 0.9997
dispcorr: -0.022875060 hartree
energy: -1079.755845782554
dipole: 23.29767 -23.50274 -0.20507 14.10070 -13.39884 0.70186 -6.68590 6.94422 0.25832
magnitude: 0.77549 au
magnitude: 1.97114 debye
