program: Gaussian 09
title: 000067798
version: EM64L-G09RevD.01
frameworkgroup: C1[X(C6H14N2O)]
method: RPBEPBE
basis: SDD
operation: Freq
keyword: #p
keyword: freq=noraman
keyword: PBEPBE/SDD
title: #p freq=noraman PBEPBE/SDD
converged: NO YES NO NO
title: Mulliken charges:
elementType: O N N C C C C C C H H H H H H H H H H H H H H
charge: -0.257835 -0.544495 -0.620632 -0.350666 -0.365625 -0.366249 -0.534484 -0.413383 0.225917 0.183203 0.183419 0.218368 0.221264 0.188912 0.189352 0.232433 0.234577 0.204885 0.205111 0.260385 0.260310 0.313247 0.331988
chargesum: 0.00000
title: Mulliken charges with hydrogens summed into heavy atoms:
elementType: O N N C C C C C C
charge: -0.257835 -0.023801 0.024602 0.015957 0.074006 0.012015 -0.067474 -0.003387 0.225917
polarizability: 1.04348932e+02 5.33327405e+00 7.97120030e+01 9.24110332e-02 1.34467486e-01 6.24279171e+01
1716.lowfreq: -24.7469 -2.6568 0.0003 0.0006 0.0007 9.4318 37.6913 49.1534 72.8397
frequency: -13.6475 47.8341 72.8315 82.8549 112.4486 151.1306 183.9307 247.5851 262.5569 336.8227 441.7133 476.3211 481.6938 514.8415 588.0587 627.6974 629.2120 724.7339 748.4363 819.3748 836.5845 920.3496 990.6357 1017.0977 1033.1509 1043.7698 1073.3458 1089.3079 1099.2489 1106.7908 1215.1852 1215.4763 1261.7176 1270.5211 1285.8094 1295.5676 1310.1322 1334.5740 1349.4401 1355.7217 1370.1544 1445.6602 1457.6893 1463.5151 1472.2520 1485.0622 1595.0001 1642.4907 1644.3214 2947.7960 2958.2204 2963.7344 2979.7977 2987.4175 3001.4084 3010.0355 3013.3795 3043.9527 3065.2851 3442.5170 3515.6834 3567.7041 3673.3038
redmass: 2.4601 3.4882 4.4710 1.8477 2.2197 2.0286 4.4238 4.4767 1.0748 3.3224 3.1208 2.3915 1.3972 1.2878 4.2580 1.4391 1.5359 1.0807 1.1631 1.3112 3.2126 1.3118 4.8450 1.1443 3.5718 2.3390 2.3823 2.8632 3.8021 1.3734 1.5122 1.3344 1.4647 1.2976 1.0409 1.1205 1.6164 1.1765 1.5223 1.5295 2.2051 1.0851 1.0773 1.0708 1.0923 1.0988 1.4286 3.5498 1.0939 1.0588 1.0591 1.0591 1.0602 1.0985 1.0604 1.0996 1.1019 1.1060 1.1037 1.0445 1.0444 1.0970 1.1045
irintensity: 7.7294 1.1886 6.0157 2.6648 2.3137 0.0539 3.6671 1.6719 60.3390 14.8063 0.5050 19.9219 26.9930 217.3566 4.9372 67.0536 312.1676 15.6142 0.6861 4.2334 2.7619 1.3118 17.7149 0.3803 6.2743 4.6183 1.1214 8.5352 9.0141 0.2187 0.3299 1.8576 40.6135 0.0783 0.1521 0.5508 62.3769 0.1980 15.8152 11.5420 83.9496 14.2290 1.2037 0.8014 0.5983 19.6546 64.4376 261.2733 50.2260 11.7686 27.5635 23.3423 75.3296 4.1899 31.2115 20.3648 0.0181 66.5586 87.4688 1.5569 25.0778 0.0387 21.2094
temp: 298.150 k
press: 1.00000 atm
elementType: 8 7 7 6 6 6 6 6 6 1 1 1 1 1 1 1 1 1 1 1 1 1 1
symmnumber: 1
zpe: 528754.7 jmol-1
zpe.correction: 0.201392 hartree
zpe.thermalcorrener: 0.212108 hartree
zpe.thermalcorrenthalpy: 0.213052 hartree
zpe.thermalcorrgfe: 0.164425 hartree
zpe.sumelectzpe: -421.023858 hartree
zpe.sumelectthermal: -421.013142 hartree
zpe.sumelectthermalent: -421.012197 hartree
zpe.sumelectthermalfe: -421.060824 hartree
dipole: -1.6609 -2.8942 -0.0709
dipole: 3.3377
quadrupole: -57.8275 -58.0481 -54.6821
quadrupole: 19.5335 -0.0014 0.0288
quadrupole: -0.9749 -1.1955 2.1704 19.5335 -0.0014 0.0288
hfenergy: -421.2252496 hartree
pointgroup: C01 [X(C6H14N2O1)]
dipole: -0.6227408 1.1558924 0.0210138 debye
dipolederiv: -0.6808267 -0.0863285 0.0009762 0.1434095 -1.0162868 -0.0038188 0.0036437 -0.0025559 -0.3485136 -1.1120021 -0.0510867 0.002992 -0.1321066 -0.4120143 0.0086499 0.0055517 0.0084497 -0.1750977 -1.0095244 0.5096873 0.0044266 0.3437987 -0.5151659 -0.0022447 0.0053891 -0.0028591 -0.7266737 -0.0802338 0.0088784 0.0001253 -0.0039305 0.097099 0.0035252 0.0012809 0.0042083 0.1940977 0.0645593 0.0059926 0.0003974 0.03247 0.0457115 0.0013623 -0.0020877 -0.0005667 0.1480746 -0.2215343 0.0126411 0.0002658 -0.1069806 0.0484713 0.0046238 0.0044978 0.0041789 0.1830073 -0.3133492 -0.0758486 0.0023174 -0.2636951 -0.0732663 0.0064168 0.0099646 0.0064599 0.198915 0.6308709 -0.0480349 0.0013172 -0.0543658 0.3520185 -0.0050461 0.0016643 -0.0047066 0.2178904 1.3965344 -0.3121608 -0.0125328 -0.2827393 1.3159678 0.0059098 -0.0176858 0.0059327 0.1820543 0.0359115 -0.0002518 -0.0035678 -0.0011135 -0.0585642 -0.1199959 -0.0041821 -0.1444518 -0.0871171 0.0362766 0.0004321 0.0030533 -0.0001153 -0.0411598 0.1172216 0.0032248 0.1413675 -0.1043651 0.0512153 0.0058165 -0.0067548 0.0099917 -0.0037127 0.0990425 0.0118899 0.1033373 -0.0726799 0.0555185 0.0046945 0.0056154 0.0097582 -0.013618 -0.1004868 -0.0127757 -0.1036332 -0.0564798 0.0376884 -0.002386 0.0070535 0.0030148 -0.0352348 0.1109403 -0.0045245 0.1400377 -0.1065168 0.0377361 -0.0034045 -0.0074549 0.0028051 -0.0519206 -0.1142926 0.0037787 -0.1432428 -0.0891451 0.036492 -0.0053648 0.0098236 0.0252993 -0.0157311 -0.1017413 0.0100973 -0.1277989 -0.0428909 0.0381901 -0.008265 -0.0072005 0.0222831 -0.0028773 0.0974228 -0.0120732 0.1234915 -0.0528213 0.0091834 0.0230071 0.0094204 -0.0081277 -0.0467194 -0.1160506 0.0071476 -0.1543971 -0.0774704 0.0091759 0.0223913 -0.0111152 -0.0085852 -0.027998 0.1127336 -0.0067166 0.1508763 -0.0959625 0.3161977 0.016245 -0.0986609 0.1483636 0.0865232 -0.1328282 -0.0462261 -0.0957728 0.0817023 0.3162842 0.0233431 0.0967153 0.151421 0.1025628 0.1310024 0.0350096 0.0942492 0.0650554 0.212555 -0.0251264 0.0013986 -0.0240606 0.1087946 -0.0013308 0.0008374 -0.0016727 0.380209 0.1330811 -0.0148711 0.0013886 -0.0067952 0.1571203 -0.0010152 0.0022943 -0.0009315 0.384728 unknown
polarizability: 104.0460131|-5.9849365|80.0159093|-0.0617729|0.0316475|62.4269293 unknown
InChI: InChI=1S/C6H14N2O/c7-5-3-1-2-4-6(8)9/h1-5,7-8H2
charge 0 multiplicity 1
23 atoms
O  -2.976242 -1.327408 -0.003531
N  4.804303 -0.409198 0.014022
N  -4.03234 0.733543 0.015918
C  0.995229 0.55604 -0.013679
C  -0.336965 -0.224137 0.015113
C  2.235418 -0.366066 0.014199
C  -1.564298 0.70631 -0.009709
C  3.576345 0.415191 -0.014143
C  -2.894712 -0.06379 0.002193
H  1.038894 1.251499 0.851759
H  1.034662 1.192196 -0.923797
H  -0.382396 -0.862043 0.91795
H  -0.38999 -0.916783 -0.845675
H  2.206002 -1.001172 0.92444
H  2.202306 -1.059621 -0.852131
H  -1.539023 1.392777 0.86176
H  -1.533543 1.349858 -0.913374
H  3.613541 1.109823 0.84816
H  3.612395 1.047875 -0.922927
H  4.915121 -1.008156 -0.811452
H  4.916824 -0.947701 0.879939
H  -3.98223 1.750718 0.020646
H  -4.944402 0.277445 0.01982
