program: Orca
programVersion: 5.0.2
elementType: O O O C C C C C C C C C C C C C C C C C C C C C C H H H H H H H H H H H H H H H H H H H H H H H H H H
charge: 0
multiplicity: 1
keywords: wb97x-d3
keywords: def2-TZVPP
keywords: def2/J RIJCOSX
keywords: DEFGRID2
keywords: scfconv7
keywords: smallprint printgap noloewdin
keywords: NOSOSCF
formula: C22H26O3
InChI: InChI=1/C22H26O3/c1-15(2)10-19-20(22(19,3)4)21(23)25-14-17-12-18(24-13-17)11-16-8-6-5-7-9-16/h5-10,12-13,19-20H,11,14H2,1-4H3
51 atoms
O  1.465523 -1.48245 0.929005
O  1.7115 -1.691636 -1.286246
O  -2.462825 -2.985506 -0.669995
C  1.617227 1.479778 -0.913977
C  2.944689 1.003242 -1.406771
C  2.331485 0.34666 -0.195944
C  1.537198 2.78305 -0.15632
C  0.384377 1.187814 -1.734484
C  4.176741 1.822698 -1.269657
C  1.818376 -1.037531 -0.282974
C  5.39332 1.339298 -1.014683
C  6.587395 2.238602 -0.911188
C  5.673401 -0.119163 -0.817818
C  0.791825 -2.737948 0.986173
C  -0.602056 -2.626532 0.48001
C  -1.59181 -1.675967 0.886815
C  -1.191752 -3.382295 -0.471854
C  -2.697585 -1.94001 0.151733
C  -4.051059 -1.321011 0.092808
C  -4.074637 0.027254 0.760359
C  -3.451173 1.115781 0.1556
C  -4.696014 0.212313 1.98799
C  -3.450731 2.359856 0.763786
C  -4.700269 1.458527 2.600758
C  -4.078023 2.535059 1.990331
H  2.893739 0.390876 -2.304188
H  2.749211 0.61193 0.769097
H  2.420505 2.962781 0.456537
H  0.668522 2.786822 0.504498
H  1.433603 3.625346 -0.843828
H  -0.493398 1.090076 -1.091778
H  0.472267 0.273497 -2.316966
H  0.198978 2.008255 -2.430549
H  4.069408 2.893719 -1.417754
H  6.323513 3.287788 -1.038766
H  7.077371 2.130372 0.059745
H  7.336033 1.985809 -1.666194
H  4.796218 -0.745942 -0.961257
H  6.441707 -0.459009 -1.516671
H  6.063974 -0.307916 0.185591
H  0.803845 -3.003441 2.04374
H  1.342717 -3.50644 0.439272
H  -1.484383 -0.891786 1.618565
H  -0.832254 -4.193034 -1.084312
H  -4.789009 -1.98122 0.559542
H  -4.35633 -1.223054 -0.953696
H  -2.959515 0.983755 -0.801273
H  -5.183655 -0.625684 2.471647
H  -2.963803 3.195873 0.278683
H  -5.191569 1.5859 3.556427
H  -4.081152 3.506757 2.466248
totalener: -1079.73094727 hartree
nucrepener: 2143.67259682 hartree
electener: -3223.40354410 hartree
oneelecener: -5725.67271403 hartree
twoeener: 2502.26916994 hartree
kineticenergy: 1074.91659124 hartree
xcener: -106.468676517598 hartree
chargesum: 0.0000000
charge: -0.262930 -0.374662 -0.254907 0.150462 -0.014349 -0.116103 -0.283198 -0.248903 -0.245165 0.326770 -0.005432 -0.211247 -0.224862 0.073850 -0.034856 -0.307678 -0.012248 0.198519 -0.065462 0.017430 -0.178437 -0.135332 -0.120890 -0.124729 -0.126240 0.105041 0.084999 0.085489 0.091253 0.089289 0.058108 0.101965 0.086980 0.092734 0.078180 0.083261 0.086893 0.082387 0.088910 0.086074 0.103532 0.100221 0.140710 0.135223 0.085640 0.104437 0.128366 0.107196 0.123622 0.124537 0.125550
qa: -0.2629 -0.3747 -0.2549 0.1505 -0.0143 -0.1161 -0.2832 -0.2489 -0.2452 0.3268 -0.0054 -0.2112 -0.2249 0.0739 -0.0349 -0.3077 -0.0122 0.1985 -0.0655 0.0174 -0.1784 -0.1353 -0.1209 -0.1247 -0.1262 0.1050 0.0850 0.0855 0.0913 0.0893 0.0581 0.1020 0.0870 0.0927 0.0782 0.0833 0.0869 0.0824 0.0889 0.0861 0.1035 0.1002 0.1407 0.1352 0.0856 0.1044 0.1284 0.1072 0.1236 0.1245 0.1256
va: 2.1196 2.1258 2.3038 3.7299 3.8276 3.8174 3.9081 3.9035 3.9048 4.2289 3.7316 3.9421 3.9395 3.8963 3.6835 3.9822 3.9968 3.6506 3.8431 3.6825 3.9747 3.9724 3.9443 3.9653 3.9566 1.0270 1.0315 1.0057 1.0063 1.0006 1.0094 1.0203 1.0037 1.0093 1.0096 0.9992 0.9986 1.0209 1.0022 1.0006 0.9857 1.0087 1.0127 1.0098 1.0075 1.0068 0.9998 1.0114 1.0022 1.0005 0.9994
dispcorr: -0.025048139 hartree
energy: -1079.755995411138
dipole: 20.03157 -20.06552 -0.03395 16.80486 -16.38647 0.41839 -2.89755 3.51626 0.61870
magnitude: 0.74766 au
magnitude: 1.90040 debye
