program: Orca
programVersion: 5.0.2
elementType: O O O C C C C C C C C C C C C C C C C C C C C C C H H H H H H H H H H H H H H H H H H H H H H H H H H
charge: 0
multiplicity: 1
keywords: wb97x-d3
keywords: def2-TZVPP
keywords: def2/J RIJCOSX
keywords: DEFGRID2
keywords: scfconv7
keywords: smallprint printgap noloewdin
keywords: NOSOSCF
formula: C22H26O3
InChI: InChI=1/C22H26O3/c1-15(2)10-19-20(22(19,3)4)21(23)25-14-17-12-18(24-13-17)11-16-8-6-5-7-9-16/h5-10,12-13,19-20H,11,14H2,1-4H3
51 atoms
O  1.002513 -1.298977 -0.561921
O  2.281979 -0.839701 1.214796
O  -1.812578 -0.307234 2.67372
C  4.282052 0.032401 -1.048935
C  3.690315 1.233677 -0.379809
C  2.772975 0.159347 -0.902095
C  4.812207 0.167015 -2.455713
C  5.054557 -0.960839 -0.215791
C  3.676746 2.582392 -1.005245
C  2.020504 -0.689504 0.048213
C  4.740762 3.3772 -1.126796
C  4.634525 4.740725 -1.739689
C  6.111685 2.993915 -0.659205
C  0.190853 -2.1672 0.235992
C  -0.827665 -1.433647 1.037805
C  -2.188764 -1.175252 0.676348
C  -0.666411 -0.877951 2.262765
C  -2.737976 -0.49149 1.707262
C  -4.0948 0.072935 1.951513
C  -5.094385 -0.441624 0.952546
C  -5.37813 0.273149 -0.205077
C  -5.73216 -1.660719 1.158351
C  -6.282045 -0.216202 -1.137351
C  -6.637806 -2.152165 0.231671
C  -6.915219 -1.430236 -0.920612
H  3.782625 1.230436 0.703956
H  2.244899 0.373487 -1.825337
H  4.816591 -0.802607 -2.956457
H  5.838353 0.539578 -2.444205
H  4.223591 0.855975 -3.059282
H  4.978835 -1.966407 -0.634226
H  4.718149 -1.000946 0.81699
H  6.112614 -0.689798 -0.211872
H  2.71677 2.945685 -1.361262
H  4.938237 5.514163 -1.029753
H  5.295845 4.83617 -2.604714
H  3.619976 4.966517 -2.065769
H  6.148662 1.996411 -0.226155
H  6.827479 3.03077 -1.484536
H  6.473532 3.698765 0.093702
H  0.821433 -2.784605 0.876975
H  -0.300125 -2.821702 -0.483062
H  -2.691267 -1.473298 -0.22988
H  0.18021 -0.812628 2.925536
H  -4.057327 1.166578 1.912873
H  -4.416541 -0.180337 2.966131
H  -4.888352 1.223998 -0.379062
H  -5.516189 -2.231817 2.053677
H  -6.493908 0.354736 -2.031987
H  -7.129616 -3.09957 0.410206
H  -7.623989 -1.81136 -1.643896
totalener: -1079.73272667 hartree
nucrepener: 2034.98581358 hartree
electener: -3114.71854025 hartree
oneelecener: -5508.35710008 hartree
twoeener: 2393.63855982 hartree
kineticenergy: 1074.90312632 hartree
xcener: -106.465699521450 hartree
chargesum: 0.0000000
charge: -0.262327 -0.413727 -0.254360 0.056816 -0.022877 -0.081441 -0.248126 -0.264906 -0.193403 0.363242 -0.016690 -0.211461 -0.249968 0.063947 -0.089794 -0.242242 0.004617 0.158774 -0.052389 0.016070 -0.151988 -0.155722 -0.124695 -0.120709 -0.128219 0.106743 0.080413 0.096059 0.083408 0.083813 0.089512 0.103871 0.079515 0.089445 0.085979 0.083844 0.079563 0.084717 0.088472 0.098038 0.112698 0.101089 0.137661 0.153266 0.089704 0.096624 0.110459 0.110822 0.124875 0.125338 0.125650
qa: -0.2623 -0.4137 -0.2544 0.0568 -0.0229 -0.0814 -0.2481 -0.2649 -0.1934 0.3632 -0.0167 -0.2115 -0.2500 0.0639 -0.0898 -0.2422 0.0046 0.1588 -0.0524 0.0161 -0.1520 -0.1557 -0.1247 -0.1207 -0.1282 0.1067 0.0804 0.0961 0.0834 0.0838 0.0895 0.1039 0.0795 0.0894 0.0860 0.0838 0.0796 0.0847 0.0885 0.0980 0.1127 0.1011 0.1377 0.1533 0.0897 0.0966 0.1105 0.1108 0.1249 0.1253 0.1257
va: 2.1380 2.0830 2.3094 3.7416 3.8142 3.8398 3.9094 3.9050 3.8699 4.2267 3.7297 3.9381 3.9360 3.8542 3.6979 4.0192 3.9662 3.7110 3.8532 3.6780 3.9704 3.9882 3.9593 3.9565 3.9535 1.0278 1.0344 1.0062 1.0016 1.0073 1.0023 1.0218 1.0029 1.0133 0.9982 0.9990 1.0105 1.0102 0.9981 1.0045 1.0095 0.9965 1.0081 1.0150 1.0048 1.0091 1.0113 1.0104 1.0003 1.0000 0.9996
dispcorr: -0.022765877 hartree
energy: -1079.755492545793
dipole: 28.78195 -28.84011 -0.05815 12.41090 -12.29566 0.11524 -12.77149 12.07469 -0.69680
magnitude: 0.70865 au
magnitude: 1.80125 debye
