program: Orca
programVersion: 5.0.2
elementType: O O O C C C C C C C C C C C C C C C C C C C C C C H H H H H H H H H H H H H H H H H H H H H H H H H H
charge: 0
multiplicity: 1
keywords: wb97x-d3
keywords: def2-TZVPP
keywords: def2/J RIJCOSX
keywords: DEFGRID2
keywords: scfconv7
keywords: smallprint printgap noloewdin
keywords: NOSOSCF
formula: C22H26O3
InChI: InChI=1/C22H26O3/c1-15(2)10-19-20(22(19,3)4)21(23)25-14-17-12-18(24-13-17)11-16-8-6-5-7-9-16/h5-10,12-13,19-20H,11,14H2,1-4H3
51 atoms
O  1.049269 -0.687296 -1.507967
O  1.300961 1.511835 -1.181679
O  -2.332082 0.551745 1.046239
C  3.829308 0.535326 0.418906
C  4.225159 1.099336 -0.903981
C  3.151621 0.03521 -0.847186
C  4.751135 -0.458562 1.085778
C  3.083884 1.4088 1.397817
C  5.552222 0.81335 -1.507214
C  1.757287 0.396679 -1.179591
C  5.78524 0.512622 -2.785356
C  7.176257 0.260943 -3.284289
C  4.709891 0.406406 -3.822578
C  -0.329407 -0.485245 -1.836081
C  -1.185455 -0.34135 -0.628018
C  -1.782779 -1.387933 0.144581
C  -1.558292 0.810395 -0.020937
C  -2.467744 -0.786797 1.145484
C  -3.317905 -1.307065 2.247223
C  -4.755194 -0.855588 2.138706
C  -5.288787 0.048228 3.047353
C  -5.565971 -1.330281 1.112181
C  -6.607682 0.467578 2.940016
C  -6.883181 -0.916291 1.002418
C  -7.408792 -0.014183 1.917726
H  3.833595 2.095615 -1.09783
H  3.4411 -0.963048 -1.155394
H  5.506905 0.057095 1.682137
H  5.272519 -1.090915 0.367156
H  4.190647 -1.11008 1.757993
H  2.444253 0.809996 2.048975
H  2.460181 2.153021 0.90913
H  3.797546 1.937274 2.032797
H  6.404852 0.8906 -0.837675
H  7.91745 0.337135 -2.489763
H  7.259241 -0.734256 -3.728227
H  7.447696 0.973694 -4.066861
H  3.723543 0.659773 -3.442173
H  4.922265 1.073177 -4.66179
H  4.664982 -0.604713 -4.235455
H  -0.610646 -1.375721 -2.397351
H  -0.439065 0.376775 -2.495519
H  -1.709446 -2.449492 -0.031563
H  -1.34055 1.844424 -0.230277
H  -2.909943 -0.99992 3.214679
H  -3.262534 -2.39757 2.224337
H  -4.667405 0.431264 3.847849
H  -5.158357 -2.025886 0.387763
H  -7.00756 1.173174 3.656428
H  -7.501852 -1.29678 0.200066
H  -8.437296 0.310869 1.832266
totalener: -1079.73215912 hartree
nucrepener: 2047.32336333 hartree
electener: -3127.05552245 hartree
oneelecener: -5533.08028465 hartree
twoeener: 2406.02476220 hartree
kineticenergy: 1074.91293072 hartree
xcener: -106.466376249790 hartree
chargesum: -0.0000000
charge: -0.262233 -0.403682 -0.248029 0.126716 -0.009828 -0.132517 -0.271826 -0.261818 -0.242310 0.361279 -0.006903 -0.211065 -0.225759 0.057107 -0.074195 -0.285878 0.007470 0.209493 -0.125529 0.068429 -0.140201 -0.157490 -0.126259 -0.128838 -0.129540 0.105002 0.089186 0.088416 0.085161 0.091941 0.087291 0.099445 0.083081 0.092489 0.078416 0.083615 0.087093 0.086364 0.090461 0.086930 0.099608 0.113365 0.125979 0.149748 0.095495 0.108183 0.104962 0.109865 0.123210 0.123769 0.124327
qa: -0.2622 -0.4037 -0.2480 0.1267 -0.0098 -0.1325 -0.2718 -0.2618 -0.2423 0.3613 -0.0069 -0.2111 -0.2258 0.0571 -0.0742 -0.2859 0.0075 0.2095 -0.1255 0.0684 -0.1402 -0.1575 -0.1263 -0.1288 -0.1295 0.1050 0.0892 0.0884 0.0852 0.0919 0.0873 0.0994 0.0831 0.0925 0.0784 0.0836 0.0871 0.0864 0.0905 0.0869 0.0996 0.1134 0.1260 0.1497 0.0955 0.1082 0.1050 0.1099 0.1232 0.1238 0.1243
va: 2.1269 2.0953 2.3177 3.7387 3.8053 3.8557 3.9073 3.9058 3.8953 4.1743 3.7438 3.9412 3.9390 3.8779 3.6682 4.0492 3.9715 3.6362 3.8784 3.6411 4.0016 3.9948 3.9648 3.9688 3.9587 1.0266 1.0293 1.0022 1.0056 1.0060 1.0015 1.0216 1.0025 1.0104 1.0101 0.9994 0.9987 1.0152 1.0019 1.0011 0.9941 1.0095 1.0168 1.0145 1.0089 1.0058 1.0119 1.0122 1.0008 1.0005 0.9999
dispcorr: -0.022643864 hartree
energy: -1079.754802982991
dipole: 28.86444 -28.63020 0.23424 -0.56024 -0.16056 -0.72081 -5.47745 5.40969 -0.06776
magnitude: 0.76093 au
magnitude: 1.93414 debye
