program: Orca
programVersion: 5.0.2
elementType: O O O C C C C C C C C C C C C C C C C C C C C C C H H H H H H H H H H H H H H H H H H H H H H H H H H
charge: 0
multiplicity: 1
keywords: wb97x-d3
keywords: def2-TZVPP
keywords: def2/J RIJCOSX
keywords: DEFGRID2
keywords: scfconv7
keywords: smallprint printgap noloewdin
keywords: NOSOSCF
formula: C22H26O3
InChI: InChI=1/C22H26O3/c1-15(2)10-19-20(22(19,3)4)21(23)25-14-17-12-18(24-13-17)11-16-8-6-5-7-9-16/h5-10,12-13,19-20H,11,14H2,1-4H3
51 atoms
O  1.165067 -0.14956 1.22694
O  2.178802 -1.597839 -0.144902
O  -2.089945 -2.689601 -0.294475
C  2.583245 0.97633 -1.888015
C  3.854002 0.647199 -1.162213
C  2.557888 0.751589 -0.388083
C  2.339989 2.394125 -2.348083
C  2.010511 -0.051386 -2.833701
C  4.920674 1.640462 -0.933205
C  1.969914 -0.465967 0.210999
C  6.219214 1.497493 -1.207828
C  7.192428 2.598373 -0.907698
C  6.833051 0.276213 -1.821899
C  0.47463 -1.225905 1.869283
C  -0.73839 -1.636056 1.112001
C  -2.042938 -1.052641 1.191416
C  -0.835747 -2.620043 0.187582
C  -2.821514 -1.733549 0.319075
C  -4.257949 -1.625938 -0.058952
C  -4.944493 -0.538493 0.720902
C  -4.878172 0.783756 0.295032
C  -5.622298 -0.827237 1.899608
C  -5.478938 1.795695 1.0278
C  -6.226828 0.181628 2.635134
C  -6.156444 1.496574 2.200939
H  4.184532 -0.375913 -1.304065
H  2.420143 1.649319 0.204875
H  1.273858 2.564586 -2.506577
H  2.852462 2.581712 -3.293414
H  2.687572 3.140263 -1.634974
H  0.925458 0.047096 -2.905619
H  2.233151 -1.072746 -2.536644
H  2.422577 0.104464 -3.832555
H  4.607741 2.581211 -0.489171
H  6.705991 3.469462 -0.470166
H  7.965162 2.26205 -0.211676
H  7.710606 2.923432 -1.813523
H  7.330834 0.529655 -2.761101
H  7.602019 -0.140615 -1.166766
H  6.11654 -0.513326 -2.035438
H  0.197462 -0.832267 2.846597
H  1.146818 -2.070957 2.022991
H  -2.354939 -0.236508 1.822786
H  -0.115217 -3.312697 -0.214766
H  -4.758757 -2.583728 0.11278
H  -4.345424 -1.429435 -1.13244
H  -4.347358 1.023435 -0.61875
H  -5.676509 -1.852146 2.246898
H  -5.419004 2.819243 0.6818
H  -6.754486 -0.060879 3.548278
H  -6.629352 2.284342 2.772307
totalener: -1079.73404317 hartree
nucrepener: 2049.28075028 hartree
electener: -3129.01479345 hartree
oneelecener: -5536.88769706 hartree
twoeener: 2407.87290361 hartree
kineticenergy: 1074.91278652 hartree
xcener: -106.468307167409 hartree
chargesum: 0.0000000
charge: -0.263211 -0.407178 -0.255308 0.092773 0.040842 -0.107074 -0.241672 -0.262095 -0.185078 0.365328 -0.049602 -0.204026 -0.237058 0.061894 -0.095496 -0.237626 0.004409 0.161029 -0.050944 0.020610 -0.161368 -0.150534 -0.121959 -0.124716 -0.127797 0.089344 0.070086 0.090420 0.091229 0.069756 0.085551 0.099006 0.084867 0.071394 0.075740 0.084297 0.083044 0.084558 0.086415 0.083418 0.101075 0.113068 0.137683 0.150794 0.090224 0.095149 0.112563 0.109776 0.125391 0.125110 0.125900
qa: -0.2632 -0.4072 -0.2553 0.0928 0.0408 -0.1071 -0.2417 -0.2621 -0.1851 0.3653 -0.0496 -0.2040 -0.2371 0.0619 -0.0955 -0.2376 0.0044 0.1610 -0.0509 0.0206 -0.1614 -0.1505 -0.1220 -0.1247 -0.1278 0.0893 0.0701 0.0904 0.0912 0.0698 0.0856 0.0990 0.0849 0.0714 0.0757 0.0843 0.0830 0.0846 0.0864 0.0834 0.1011 0.1131 0.1377 0.1508 0.0902 0.0951 0.1126 0.1098 0.1254 0.1251 0.1259
va: 2.1378 2.0935 2.3056 3.7365 3.7767 3.9058 3.9132 3.9139 3.8963 4.2140 3.8184 3.9358 3.9466 3.8674 3.7007 4.0111 3.9670 3.7077 3.8618 3.6710 3.9784 3.9853 3.9565 3.9620 3.9541 1.0359 1.0393 1.0045 1.0045 1.0111 1.0024 1.0232 1.0012 1.0210 1.0122 0.9982 0.9982 0.9993 0.9991 1.0154 0.9944 1.0101 1.0080 1.0143 1.0094 1.0054 1.0106 1.0112 1.0002 1.0004 0.9996
dispcorr: -0.021996524 hartree
energy: -1079.756039693473
dipole: 25.42890 -25.60974 -0.18083 13.91282 -13.27881 0.63401 -11.96540 12.08247 0.11707
magnitude: 0.66961 au
magnitude: 1.70202 debye
