program: Orca
programVersion: 5.0.2
elementType: O O O C C C C C C C C C C C C C C C C C C C C C C H H H H H H H H H H H H H H H H H H H H H H H H H H
charge: 0
multiplicity: 1
keywords: wb97x-d3
keywords: def2-TZVPP
keywords: def2/J RIJCOSX
keywords: DEFGRID2
keywords: scfconv7
keywords: smallprint printgap noloewdin
keywords: NOSOSCF
formula: C22H26O3
InChI: InChI=1/C22H26O3/c1-15(2)10-19-20(22(19,3)4)21(23)25-14-17-12-18(24-13-17)11-16-8-6-5-7-9-16/h5-10,12-13,19-20H,11,14H2,1-4H3
51 atoms
O  1.969096 -2.245231 -0.726479
O  2.120231 -1.664713 1.429378
O  -2.334434 -2.153605 -0.827076
C  3.935921 0.666381 0.367432
C  2.523951 1.128756 0.492949
C  2.828229 -0.143753 -0.276789
C  4.845057 1.38183 -0.603935
C  4.656115 0.152979 1.58994
C  2.000309 2.325323 -0.212868
C  2.298345 -1.410197 0.265187
C  0.849969 2.381112 -0.887149
C  0.400799 3.648736 -1.54896
C  -0.077555 1.21509 -1.055686
C  1.099943 -3.334962 -0.402218
C  -0.301189 -2.847385 -0.271055
C  -0.939158 -2.291499 0.884021
C  -1.204978 -2.730238 -1.272367
C  -2.16688 -1.88486 0.486454
C  -3.2741 -1.178993 1.185252
C  -3.360648 0.278448 0.796082
C  -2.764277 1.256676 1.583052
C  -4.007584 0.664205 -0.373651
C  -2.815697 2.593235 1.216036
C  -4.0580 1.998798 -0.746235
C  -3.462807 2.968448 0.048321
H  2.083456 0.940138 1.469653
H  2.76958 -0.065042 -1.35603
H  5.313749 2.245589 -0.12786
H  4.311654 1.739269 -1.484623
H  5.643321 0.719309 -0.942542
H  5.427071 -0.568209 1.311701
H  3.989836 -0.328649 2.30073
H  5.150738 0.981933 2.099964
H  2.60016 3.228681 -0.138314
H  0.241336 3.496909 -2.619555
H  -0.555992 3.979939 -1.137749
H  1.121591 4.456652 -1.427301
H  0.108853 0.40655 -0.353239
H  -1.115183 1.526273 -0.924814
H  -0.000514 0.802838 -2.065666
H  1.433364 -3.845815 0.501604
H  1.194006 -4.026829 -1.23841
H  -0.518559 -2.199182 1.871348
H  -1.178067 -3.005403 -2.314671
H  -3.104248 -1.267333 2.259222
H  -4.22533 -1.678147 0.979676
H  -2.24935 0.970716 2.492444
H  -4.47644 -0.085494 -0.999149
H  -2.34618 3.341012 1.841387
H  -4.566097 2.282958 -1.658476
H  -3.506426 4.010779 -0.239422
totalener: -1079.73060044 hartree
nucrepener: 2234.79514338 hartree
electener: -3314.52574383 hartree
oneelecener: -5908.10314340 hartree
twoeener: 2593.57739957 hartree
kineticenergy: 1074.91623361 hartree
xcener: -106.469595995514 hartree
chargesum: -0.0000000
charge: -0.262208 -0.401525 -0.253697 0.143874 -0.013647 -0.112515 -0.268154 -0.260522 -0.261170 0.337018 0.012299 -0.209741 -0.168923 0.055856 -0.074870 -0.251459 -0.027362 0.219206 -0.128366 0.084458 -0.170247 -0.159382 -0.098564 -0.095868 -0.181191 0.100218 0.085151 0.087222 0.085019 0.090840 0.083065 0.100222 0.080356 0.091647 0.086335 0.080930 0.078186 0.054524 0.058332 0.098005 0.112209 0.099761 0.143294 0.133683 0.095096 0.109621 0.106772 0.110850 0.124855 0.123822 0.126685
qa: -0.2622 -0.4015 -0.2537 0.1439 -0.0136 -0.1125 -0.2682 -0.2605 -0.2612 0.3370 0.0123 -0.2097 -0.1689 0.0559 -0.0749 -0.2515 -0.0274 0.2192 -0.1284 0.0845 -0.1702 -0.1594 -0.0986 -0.0959 -0.1812 0.1002 0.0852 0.0872 0.0850 0.0908 0.0831 0.1002 0.0804 0.0916 0.0863 0.0809 0.0782 0.0545 0.0583 0.0980 0.1122 0.0998 0.1433 0.1337 0.0951 0.1096 0.1068 0.1109 0.1249 0.1238 0.1267
va: 2.1149 2.0913 2.2977 3.7138 3.8104 3.8454 3.9059 3.8998 3.8877 4.1994 3.7575 3.9387 3.9317 3.8952 3.7216 3.9785 3.9740 3.5978 3.8757 3.6091 3.9710 4.0006 3.8844 3.9061 3.9317 1.0295 1.0319 1.0024 1.0060 1.0062 1.0024 1.0229 1.0019 1.0112 0.9995 1.0009 1.0106 1.0234 1.0126 1.0071 1.0086 0.9959 1.0242 1.0069 1.0146 1.0064 1.0122 1.0188 1.0011 1.0005 1.0017
dispcorr: -0.028786227 hartree
energy: -1079.759386670486
dipole: 12.31837 -12.62435 -0.30598 16.61312 -16.40776 0.20536 -2.59874 2.10090 -0.49784
magnitude: 0.61939 au
magnitude: 1.57436 debye
