program: Orca
programVersion: 5.0.2
elementType: O O O C C C C C C C C C C C C C C C C C C C C C C H H H H H H H H H H H H H H H H H H H H H H H H H H
charge: 0
multiplicity: 1
keywords: wb97x-d3
keywords: def2-TZVPP
keywords: def2/J RIJCOSX
keywords: DEFGRID2
keywords: scfconv7
keywords: smallprint printgap noloewdin
keywords: NOSOSCF
formula: C22H26O3
InChI: InChI=1/C22H26O3/c1-15(2)10-19-20(22(19,3)4)21(23)25-14-17-12-18(24-13-17)11-16-8-6-5-7-9-16/h5-10,12-13,19-20H,11,14H2,1-4H3
51 atoms
O  1.195869 -0.41666 1.065934
O  1.993933 -1.579249 -0.671516
O  -2.305084 -2.545721 -0.57016
C  2.473369 1.276268 -1.870348
C  3.756452 0.741998 -1.307925
C  2.506452 0.746629 -0.449657
C  2.28944 2.768524 -2.015519
C  1.795564 0.495954 -2.970427
C  4.892187 1.6076 -0.939881
C  1.888665 -0.542255 -0.067769
C  6.179751 1.415344 -1.236836
C  7.225746 2.388273 -0.778054
C  6.712586 0.258392 -2.026831
C  0.517686 -1.580837 1.548567
C  -0.779203 -1.80199 0.855152
C  -2.038328 -1.191346 1.15741
C  -1.01149 -2.60791 -0.206934
C  -2.92669 -1.681218 0.26152
C  -4.383197 -1.460527 0.041849
C  -4.930039 -0.416353 0.975814
C  -4.707442 0.934512 0.726078
C  -5.639761 -0.77614 2.114785
C  -5.184388 1.903079 1.594625
C  -6.121823 0.190596 2.986026
C  -5.894738 1.53332 2.728269
H  4.013743 -0.244375 -1.677539
H  2.457251 1.507963 0.321182
H  2.758457 3.122816 -2.935061
H  2.718531 3.334728 -1.190079
H  1.228004 3.017293 -2.064903
H  2.160466 0.842738 -3.939059
H  0.715045 0.651313 -2.949753
H  1.979343 -0.573218 -2.907191
H  4.645551 2.490725 -0.357407
H  6.799591 3.210311 -0.203868
H  7.973769 1.895796 -0.151448
H  7.765059 2.816662 -1.626887
H  7.430023 -0.315329 -1.43481
H  5.942722 -0.429037 -2.369251
H  7.25203 0.612421 -2.908845
H  0.353765 -1.384574 2.607671
H  1.161138 -2.457529 1.463155
H  -2.249154 -0.483138 1.942342
H  -0.367523 -3.24672 -0.788442
H  -4.925245 -2.401864 0.175903
H  -4.555884 -1.160792 -0.996961
H  -4.150105 1.228655 -0.15542
H  -5.817764 -1.824199 2.324345
H  -5.003745 2.949325 1.385383
H  -6.676239 -0.10724 3.866313
H  -6.270766 2.288991 3.405174
totalener: -1079.73406582 hartree
nucrepener: 2048.15025353 hartree
electener: -3127.88431935 hartree
oneelecener: -5534.62916053 hartree
twoeener: 2406.74484118 hartree
kineticenergy: 1074.90425396 hartree
xcener: -106.466866440763 hartree
chargesum: 0.0000000
charge: -0.263794 -0.407429 -0.255597 0.089858 0.042392 -0.101185 -0.245647 -0.258329 -0.184658 0.366930 -0.051937 -0.204088 -0.236233 0.061370 -0.092696 -0.242655 0.007422 0.165283 -0.054018 0.022597 -0.171436 -0.146201 -0.117590 -0.124174 -0.129990 0.087749 0.070125 0.091339 0.070360 0.090535 0.084012 0.085314 0.098862 0.070378 0.075930 0.084415 0.083326 0.086369 0.083256 0.084090 0.101131 0.111916 0.137865 0.148638 0.086781 0.099798 0.115354 0.108236 0.124962 0.125188 0.125878
qa: -0.2638 -0.4074 -0.2556 0.0899 0.0424 -0.1012 -0.2456 -0.2583 -0.1847 0.3669 -0.0519 -0.2041 -0.2362 0.0614 -0.0927 -0.2427 0.0074 0.1653 -0.0540 0.0226 -0.1714 -0.1462 -0.1176 -0.1242 -0.1300 0.0877 0.0701 0.0913 0.0704 0.0905 0.0840 0.0853 0.0989 0.0704 0.0759 0.0844 0.0833 0.0864 0.0833 0.0841 0.1011 0.1119 0.1379 0.1486 0.0868 0.0998 0.1154 0.1082 0.1250 0.1252 0.1259
va: 2.1375 2.0935 2.3058 3.7357 3.7814 3.8922 3.9157 3.9137 3.9007 4.2102 3.8254 3.9348 3.9458 3.8710 3.6945 4.0106 3.9705 3.6987 3.8564 3.6679 3.9813 3.9829 3.9509 3.9630 3.9565 1.0358 1.0385 1.0042 1.0112 1.0041 1.0008 1.0026 1.0235 1.0217 1.0124 0.9981 0.9982 0.9989 1.0158 0.9995 0.9942 1.0100 1.0086 1.0148 1.0102 1.0047 1.0096 1.0115 1.0002 1.0005 0.9998
dispcorr: -0.021861673 hartree
energy: -1079.755927493089
dipole: 25.57987 -25.68524 -0.10537 14.81185 -14.22218 0.58967 -10.43334 10.70939 0.27605
magnitude: 0.65956 au
magnitude: 1.67646 debye
