program: Orca
programVersion: 5.0.2
elementType: O O O C C C C C C C C C C C C C C C C C C C C C C H H H H H H H H H H H H H H H H H H H H H H H H H H
charge: 0
multiplicity: 1
keywords: wb97x-d3
keywords: def2-TZVPP
keywords: def2/J RIJCOSX
keywords: DEFGRID2
keywords: scfconv7
keywords: smallprint printgap noloewdin
keywords: NOSOSCF
formula: C22H26O3
InChI: InChI=1/C22H26O3/c1-15(2)10-19-20(22(19,3)4)21(23)25-14-17-12-18(24-13-17)11-16-8-6-5-7-9-16/h5-10,12-13,19-20H,11,14H2,1-4H3
51 atoms
O  1.314436 -1.560092 -0.622069
O  2.606079 -1.278179 1.182315
O  -1.412925 -0.337927 2.568075
C  4.642698 -0.204605 -0.958202
C  4.010101 0.923046 -0.21609
C  3.128308 -0.133168 -0.849115
C  5.200881 0.054098 -2.337502
C  5.418437 -1.24658 -0.189655
C  4.006733 2.314742 -0.73485
C  2.356193 -1.037399 0.027701
C  2.992125 3.174153 -0.627057
C  3.093115 4.57104 -1.161037
C  1.68671 2.835472 0.026509
C  0.421734 -2.37835 0.142059
C  -0.530695 -1.560277 0.942594
C  -1.833512 -1.121636 0.54484
C  -0.338138 -1.048814 2.182427
C  -2.321948 -0.38595 1.570659
C  -3.601235 0.348466 1.776008
C  -4.616727 -0.031105 0.733447
C  -4.785836 0.733318 -0.414353
C  -5.377369 -1.185731 0.886653
C  -5.699141 0.355627 -1.388818
C  -6.29246 -1.565126 -0.081771
C  -6.455636 -0.794211 -1.224306
H  4.074498 0.834028 0.866021
H  2.616461 0.152984 -1.760734
H  4.613598 0.78259 -2.896167
H  5.226375 -0.868226 -2.919976
H  6.22378 0.431451 -2.27441
H  5.050793 -1.385547 0.823385
H  6.466885 -0.950083 -0.126041
H  5.381959 -2.212879 -0.695998
H  4.922029 2.657191 -1.210053
H  4.054529 4.759898 -1.637001
H  2.308813 4.76887 -1.895893
H  2.963037 5.306039 -0.362926
H  1.668103 1.839121 0.461306
H  1.461571 3.548819 0.822846
H  0.86466 2.903238 -0.69056
H  0.984819 -3.063935 0.776283
H  -0.116006 -2.968608 -0.598719
H  -2.339412 -1.338336 -0.382237
H  0.486975 -1.104733 2.872602
H  -3.422636 1.428408 1.750499
H  -3.990716 0.132262 2.775238
H  -4.196352 1.63249 -0.548746
H  -5.247375 -1.794613 1.77347
H  -5.82044 0.962811 -2.276341
H  -6.87978 -2.4636 0.055293
H  -7.170575 -1.088426 -1.981285
totalener: -1079.73249066 hartree
nucrepener: 2088.62866342 hartree
electener: -3168.36115408 hartree
oneelecener: -5615.60607533 hartree
twoeener: 2447.24492125 hartree
kineticenergy: 1074.91306838 hartree
xcener: -106.467571701113 hartree
chargesum: -0.0000000
charge: -0.260329 -0.410059 -0.254895 0.125873 -0.019874 -0.105708 -0.273213 -0.260771 -0.241560 0.342778 -0.005488 -0.212464 -0.215664 0.067188 -0.086322 -0.243353 -0.002094 0.160885 -0.052598 0.018069 -0.151793 -0.158058 -0.124566 -0.120619 -0.126988 0.104481 0.086680 0.084963 0.091022 0.089369 0.101097 0.082418 0.085414 0.092026 0.078498 0.083684 0.086913 0.081226 0.088676 0.086017 0.113334 0.100635 0.137426 0.154041 0.088427 0.098257 0.109430 0.111701 0.124919 0.125017 0.125953
qa: -0.2603 -0.4101 -0.2549 0.1259 -0.0199 -0.1057 -0.2732 -0.2608 -0.2416 0.3428 -0.0055 -0.2125 -0.2157 0.0672 -0.0863 -0.2434 -0.0021 0.1609 -0.0526 0.0181 -0.1518 -0.1581 -0.1246 -0.1206 -0.1270 0.1045 0.0867 0.0850 0.0910 0.0894 0.1011 0.0824 0.0854 0.0920 0.0785 0.0837 0.0869 0.0812 0.0887 0.0860 0.1133 0.1006 0.1374 0.1540 0.0884 0.0983 0.1094 0.1117 0.1249 0.1250 0.1260
va: 2.1291 2.0806 2.3047 3.7312 3.8190 3.8244 3.9112 3.9025 3.8986 4.2018 3.7443 3.9414 3.9470 3.8475 3.7016 4.0153 3.9583 3.7020 3.8543 3.6811 3.9719 3.9882 3.9603 3.9565 3.9538 1.0283 1.0318 1.0053 1.0062 1.0015 1.0213 1.0023 1.0018 1.0104 1.0098 0.9990 0.9986 1.0144 1.0019 1.0015 1.0108 0.9956 1.0079 1.0145 1.0052 1.0088 1.0117 1.0103 1.0005 1.0002 0.9996
dispcorr: -0.023208722 hartree
energy: -1079.755699383409
dipole: 18.85457 -19.25633 -0.40176 12.51720 -12.29696 0.22025 -10.42786 9.77618 -0.65167
magnitude: 0.79661 au
magnitude: 2.02483 debye
