program: Gaussian 09
title: 000067789
version: EM64L-G09RevD.01
frameworkgroup: C1[X(C6H5FS)]
method: RPBEPBE
basis: SDD
operation: Freq
keyword: #pfreq=noraman
keyword: PBEPBE/SDD
title: #p freq=noraman PBEPBE/SDD
converged: NO YES NO NO
title: Mulliken charges:
elementType: S F C C C C C C H H H H H
charge: 0.000374 -0.206879 -0.203525 -0.147272 -0.176195 -0.349827 -0.349426 0.320623 0.231270 0.247566 0.258071 0.259093 0.116125
chargesum: 0.00000
title: Mulliken charges with hydrogens summed into heavy atoms:
elementType: S F C C C C C C
charge: 0.116500 -0.206879 -0.203525 0.083998 0.071370 -0.091756 -0.090333 0.320623
polarizability: 1.15558798e+02 -1.82007224e+00 8.17288176e+01 8.46683596e-03 -1.65897298e-03 3.02104259e+01
1716.lowfreq: -8.8645 -0.0024 -0.0015 0.0009 1.0394 20.2702 115.5360 156.6143 235.1387
frequency: 115.4490 155.9522 235.1279 320.1221 354.8920 388.2124 408.4181 490.8478 592.9698 622.9853 694.2884 789.8305 803.0997 818.8945 882.7598 924.6139 944.1364 998.2636 1076.5205 1105.8733 1159.0085 1201.3206 1288.6280 1365.2862 1399.6498 1472.5441 1595.0562 1599.7992 2443.4464 3135.3931 3148.6169 3175.7017 3178.7408
redmass: 8.7190 1.1041 6.8976 6.6466 15.4331 5.1267 2.9385 2.6830 8.2422 7.2132 3.8565 6.9080 1.2848 1.4926 1.1094 1.3341 1.3491 3.5379 3.0257 1.2967 1.4889 2.1651 1.2489 6.1362 3.7695 2.3915 7.8172 6.4661 1.0383 1.0903 1.0897 1.0955 1.0967
irintensity: 4.5890 25.8489 2.9726 3.4404 0.0602 2.2022 0.1828 30.6725 33.1578 0.1127 0.0027 4.6081 14.2298 76.7451 11.6920 1.6255 0.0469 21.2281 34.5207 11.7742 19.9370 60.0719 3.3628 3.7857 1.0553 151.7522 3.4756 1.0005 15.3300 7.5910 4.3039 3.3374 1.9067
temp: 298.150 k
press: 1.00000 atm
elementType: 16 9 6 6 6 6 6 6 1 1 1 1 1
symmnumber: 1
zpe: 232592.6 jmol-1
zpe.correction: 0.088590 hartree
zpe.thermalcorrener: 0.095850 hartree
zpe.thermalcorrenthalpy: 0.096794 hartree
zpe.thermalcorrgfe: 0.056620 hartree
zpe.sumelectzpe: -728.955626 hartree
zpe.sumelectthermal: -728.948366 hartree
zpe.sumelectthermalent: -728.947422 hartree
zpe.sumelectthermalfe: -728.987595 hartree
dipole: -1.2797 1.0725 -0.0003
dipole: 1.6697
quadrupole: -59.7869 -43.9119 -57.5751
quadrupole: -4.0111 -0.0001 -0.0008
quadrupole: -6.0289 9.8461 -3.8171 -4.0111 -0.0001 -0.0008
hfenergy: -729.0442159 hartree
pointgroup: C01 [X(C6H5F1S1)]
dipole: -0.5000942 0.4259361 -0.0001026 debye
dipolederiv: -0.5579762 0.0736614 -0.0000398 0.1103456 0.1874928 -0.0000063 -0.0000393 -0.0000097 -0.1572577 -1.1952379 0.0168353 -0.0001169 0.0092701 -0.2069418 0.0000025 -0.0000892 0.0000031 -0.1501459 1.0402824 -0.019328 0.0000966 -0.1408442 -0.1738654 -0.0000084 0.0000971 0.0000019 -0.0933408 -0.2721001 0.0255952 -0.0000059 -0.1284222 0.0772966 -0.0000261 0.0000054 -0.0000091 -0.1369914 -0.2328692 -0.0119866 -0.0000017 0.1454786 0.0958682 0.0000174 -0.0000042 0.0000002 -0.1131024 -0.1167209 -0.0421982 0.0000026 0.1174524 0.0073303 0.0000056 -0.000002 -0.0000124 -0.1440996 -0.0882693 0.0333163 0.0000035 -0.1189903 0.0098696 -0.0000151 0.0000092 0.0000005 -0.1559784 1.233902 -0.009593 0.0001291 -0.0270702 0.1667703 -0.000005 0.0000974 -0.0000026 0.0760696 0.0143777 0.0968684 -0.0000186 0.0691747 -0.0236107 0.0000162 -0.0000157 0.0000189 0.1589098 0.0484609 -0.0858884 -0.0000111 -0.0653132 -0.0077044 -0.0000075 -0.0000102 -0.000009 0.1629748 0.0395674 -0.0621992 -0.000013 -0.0695029 0.0033824 0.0000018 -0.0000142 0.0000034 0.1859208 0.0468439 0.0649784 -0.0000161 0.0700535 0.0016288 0.0000086 -0.0000172 0.0000078 0.1856304 0.0397394 -0.0800617 -0.0000086 0.0283681 -0.1375166 0.0000163 -0.0000172 0.0000069 0.1814108 unknown
polarizability: 115.5277755|-2.0883438|81.7598398|0.0084534|-0.0017261|30.2104259 unknown
InChI: InChI=1S/C6H5FS/c7-5-1-3-6(8)4-2-5/h1-4,8H
charge 0 multiplicity 1
13 atoms
S  -3.184182 -0.053188 -0.000326
F  2.859324 -0.015497 0.00027
C  -1.348155 0.021363 -0.00017
C  -0.627871 1.240513 -0.000145
C  -0.648494 -1.211914 -0.000081
C  0.784841 1.233943 0.000002
C  0.763001 -1.229992 0.000068
C  1.44967 -0.00348 0.000133
H  -1.155414 2.201025 -0.000248
H  -1.198187 -2.158877 -0.00014
H  1.356429 2.166462 0.000012
H  1.317962 -2.172466 0.00013
H  -3.403924 1.314209 -0.000404
