program: Orca
programVersion: 5.0.2
elementType: O O O C C C C C C C C C C C C C C C C C C C C C C H H H H H H H H H H H H H H H H H H H H H H H H H H
charge: 0
multiplicity: 1
keywords: wb97x-d3
keywords: def2-TZVPP
keywords: def2/J RIJCOSX
keywords: DEFGRID2
keywords: scfconv7
keywords: smallprint printgap noloewdin
keywords: NOSOSCF
formula: C22H26O3
InChI: InChI=1/C22H26O3/c1-15(2)10-19-20(22(19,3)4)21(23)25-14-17-12-18(24-13-17)11-16-8-6-5-7-9-16/h5-10,12-13,19-20H,11,14H2,1-4H3
51 atoms
O  1.245305 -1.107447 0.068975
O  3.347711 -1.797545 0.385394
O  -2.781797 -1.912665 1.606278
C  3.943356 0.346072 -1.846688
C  4.288721 0.892616 -0.50378
C  2.919947 0.281281 -0.724666
C  3.609251 1.309616 -2.961274
C  4.641731 -0.902526 -2.326914
C  4.434177 2.350264 -0.254834
C  2.57033 -0.982403 -0.041097
C  4.07441 2.981537 0.863692
C  4.2841 4.4558 1.03178
C  3.438527 2.290616 2.030529
C  0.754282 -2.267115 0.745907
C  -0.723175 -2.151404 0.813116
C  -1.652206 -2.183571 -0.27442
C  -1.477102 -1.982591 1.923307
C  -2.883745 -2.032652 0.266318
C  -4.240465 -1.934108 -0.33018
C  -4.837371 -0.552679 -0.19412
C  -4.23157 0.534103 -0.817687
C  -5.988702 -0.339547 0.551383
C  -4.770062 1.804616 -0.703359
C  -6.5310 0.933102 0.670175
C  -5.923491 2.008271 0.042417
H  4.952707 0.255267 0.075971
H  2.095606 0.978602 -0.820058
H  3.080504 2.193219 -2.603528
H  2.978733 0.826301 -3.709334
H  4.517366 1.647555 -3.465211
H  4.918578 -1.570494 -1.515123
H  5.55494 -0.628288 -2.858642
H  4.012728 -1.461135 -3.022804
H  4.901853 2.931909 -1.044529
H  4.933717 4.665396 1.88512
H  4.733239 4.909838 0.149223
H  3.338217 4.966758 1.228943
H  3.385723 1.211105 1.909977
H  3.994306 2.495914 2.948535
H  2.423067 2.660978 2.19432
H  1.185926 -2.33625 1.747587
H  1.056626 -3.166692 0.203019
H  -1.42382 -2.29871 -1.321894
H  -1.22586 -1.902226 2.968771
H  -4.907685 -2.671646 0.124419
H  -4.160142 -2.203724 -1.385728
H  -3.323741 0.383733 -1.390322
H  -6.467603 -1.175637 1.046903
H  -4.287849 2.639418 -1.195143
H  -7.429145 1.082418 1.255045
H  -6.343985 3.001024 0.133812
totalener: -1079.73207316 hartree
nucrepener: 2044.92492972 hartree
electener: -3124.65700288 hartree
oneelecener: -5527.99867570 hartree
twoeener: 2403.34167281 hartree
kineticenergy: 1074.90607369 hartree
xcener: -106.463562092472 hartree
chargesum: -0.0000000
charge: -0.251201 -0.389568 -0.248630 0.128264 -0.022552 -0.099025 -0.273362 -0.257752 -0.235741 0.319512 -0.003835 -0.211062 -0.227082 0.058931 -0.025576 -0.267859 -0.031102 0.209159 -0.127896 0.059308 -0.152997 -0.144494 -0.128570 -0.122813 -0.131386 0.104369 0.086957 0.085607 0.090418 0.089654 0.101720 0.083454 0.083262 0.092436 0.086881 0.077803 0.084439 0.082278 0.088827 0.090075 0.089270 0.101947 0.128497 0.136945 0.094233 0.109830 0.113409 0.104235 0.123152 0.123457 0.124173
qa: -0.2512 -0.3896 -0.2486 0.1283 -0.0226 -0.0990 -0.2734 -0.2578 -0.2357 0.3195 -0.0038 -0.2111 -0.2271 0.0589 -0.0256 -0.2679 -0.0311 0.2092 -0.1279 0.0593 -0.1530 -0.1445 -0.1286 -0.1228 -0.1314 0.1044 0.0870 0.0856 0.0904 0.0897 0.1017 0.0835 0.0833 0.0924 0.0869 0.0778 0.0844 0.0823 0.0888 0.0901 0.0893 0.1019 0.1285 0.1369 0.0942 0.1098 0.1134 0.1042 0.1232 0.1235 0.1242
va: 2.1219 2.1122 2.3123 3.7327 3.8216 3.8385 3.9112 3.9008 3.8976 4.2035 3.7366 3.9420 3.9434 3.8754 3.7340 4.0262 3.9834 3.6333 3.8873 3.6602 3.9898 4.0010 3.9729 3.9619 3.9611 1.0272 1.0306 1.0046 1.0065 1.0015 1.0212 1.0023 1.0020 1.0096 0.9989 1.0099 0.9989 1.0160 1.0020 1.0004 1.0063 0.9937 1.0178 1.0079 1.0122 1.0043 1.0121 1.0119 1.0010 1.0008 1.0001
dispcorr: -0.021857396 hartree
energy: -1079.753930556456
dipole: 21.12987 -21.63928 -0.50942 16.36772 -15.88295 0.48477 -6.17148 5.90200 -0.26948
magnitude: 0.75308 au
magnitude: 1.91417 debye
