program: Orca
programVersion: 5.0.2
elementType: O O O C C C C C C C C C C C C C C C C C C C C C C H H H H H H H H H H H H H H H H H H H H H H H H H H
charge: 0
multiplicity: 1
keywords: wb97x-d3
keywords: def2-TZVPP
keywords: def2/J RIJCOSX
keywords: DEFGRID2
keywords: scfconv7
keywords: smallprint printgap noloewdin
keywords: NOSOSCF
formula: C22H26O3
InChI: InChI=1/C22H26O3/c1-15(2)10-19-20(22(19,3)4)21(23)25-14-17-12-18(24-13-17)11-16-8-6-5-7-9-16/h5-10,12-13,19-20H,11,14H2,1-4H3
51 atoms
O  1.035662 -1.059504 0.254056
O  3.150084 -1.776955 0.347067
O  -2.958113 -2.178352 1.717698
C  3.577901 0.572142 -1.707413
C  4.044219 0.976563 -0.342459
C  2.659666 0.406414 -0.507387
C  3.186467 1.653995 -2.684342
C  4.209311 -0.627408 -2.370237
C  4.212837 2.395873 0.063438
C  2.35028 -0.921604 0.068418
C  5.300564 3.128769 -0.17655
C  5.41454 4.543103 0.304867
C  6.490255 2.60734 -0.923674
C  0.582741 -2.295321 0.81176
C  -0.896748 -2.228957 0.897625
C  -1.829029 -2.120178 -0.182045
C  -1.65059 -2.255655 2.020327
C  -3.06219 -2.091483 0.375184
C  -4.423671 -1.947126 -0.199429
C  -5.094912 -0.649391 0.18788
C  -4.47681 0.568508 -0.080627
C  -6.339733 -0.645851 0.802817
C  -5.094852 1.762171 0.252625
C  -6.962168 0.548677 1.139493
C  -6.341464 1.756221 0.864364
H  4.745197 0.280161 0.111066
H  1.835438 1.110781 -0.46669
H  2.689546 2.494614 -2.201458
H  2.514093 1.258053 -3.447652
H  4.070238 2.047724 -3.19107
H  4.543086 -1.377808 -1.658064
H  5.076714 -0.30919 -2.952517
H  3.51185 -1.105499 -3.061119
H  3.39446 2.85039 0.614533
H  5.584718 5.230064 -0.527864
H  4.520165 4.870006 0.833805
H  6.264853 4.658861 0.981763
H  6.34886 1.592526 -1.290644
H  6.717771 3.245016 -1.781537
H  7.380675 2.613661 -0.289763
H  1.023879 -2.45252 1.799465
H  0.905588 -3.126303 0.179156
H  -1.602963 -2.063969 -1.234768
H  -1.395897 -2.328439 3.065532
H  -5.052426 -2.789638 0.102167
H  -4.333017 -2.008762 -1.286623
H  -3.498672 0.580692 -0.547404
H  -6.829547 -1.586533 1.025173
H  -4.601034 2.70105 0.038162
H  -7.930919 0.532898 1.621686
H  -6.823028 2.68877 1.127534
totalener: -1079.73228637 hartree
nucrepener: 2016.48850333 hartree
electener: -3096.22078970 hartree
oneelecener: -5471.10757259 hartree
twoeener: 2374.88678289 hartree
kineticenergy: 1074.90621124 hartree
xcener: -106.463416209204 hartree
chargesum: -0.0000000
charge: -0.253979 -0.389331 -0.247500 0.079500 -0.028593 -0.090132 -0.241023 -0.268847 -0.183348 0.334493 -0.029262 -0.211841 -0.238248 0.058979 -0.019969 -0.272440 -0.031610 0.203533 -0.113746 0.048220 -0.152670 -0.144583 -0.129140 -0.122845 -0.131772 0.107805 0.079744 0.081369 0.093286 0.085615 0.104896 0.081561 0.087536 0.089735 0.083373 0.079282 0.086455 0.082174 0.085331 0.096674 0.090417 0.102832 0.128693 0.136842 0.092253 0.105782 0.117092 0.105185 0.124317 0.123322 0.124584
qa: -0.2540 -0.3893 -0.2475 0.0795 -0.0286 -0.0901 -0.2410 -0.2688 -0.1833 0.3345 -0.0293 -0.2118 -0.2382 0.0590 -0.0200 -0.2724 -0.0316 0.2035 -0.1137 0.0482 -0.1527 -0.1446 -0.1291 -0.1228 -0.1318 0.1078 0.0797 0.0814 0.0933 0.0856 0.1049 0.0816 0.0875 0.0897 0.0834 0.0793 0.0865 0.0822 0.0853 0.0967 0.0904 0.1028 0.1287 0.1368 0.0923 0.1058 0.1171 0.1052 0.1243 0.1233 0.1246
va: 2.1305 2.1160 2.3128 3.7218 3.8098 3.8896 3.9081 3.9037 3.8542 4.2387 3.7398 3.9399 3.9377 3.8740 3.7246 4.0214 3.9847 3.6370 3.8876 3.6872 3.9857 3.9961 3.9693 3.9636 3.9619 1.0268 1.0341 1.0076 1.0057 1.0027 1.0214 1.0024 1.0030 1.0130 0.9989 1.0107 0.9978 1.0112 0.9998 1.0023 1.0045 0.9942 1.0184 1.0083 1.0114 1.0033 1.0117 1.0113 1.0011 1.0008 1.0000
dispcorr: -0.021905601 hartree
energy: -1079.754191970325
dipole: 27.34137 -27.62784 -0.28647 18.23151 -17.70416 0.52735 -12.20596 11.78451 -0.42146
magnitude: 0.73334 au
magnitude: 1.86400 debye
