program: Orca
programVersion: 5.0.2
elementType: O O O C C C C C C C C C C C C C C C C C C C C C C H H H H H H H H H H H H H H H H H H H H H H H H H H
charge: 0
multiplicity: 1
keywords: wb97x-d3
keywords: def2-TZVPP
keywords: def2/J RIJCOSX
keywords: DEFGRID2
keywords: scfconv7
keywords: smallprint printgap noloewdin
keywords: NOSOSCF
formula: C22H26O3
InChI: InChI=1/C22H26O3/c1-15(2)10-19-20(22(19,3)4)21(23)25-14-17-12-18(24-13-17)11-16-8-6-5-7-9-16/h5-10,12-13,19-20H,11,14H2,1-4H3
51 atoms
O  0.994778 -1.025473 0.138799
O  3.077828 -1.828667 0.029245
O  -3.003177 -2.118076 1.562773
C  3.459492 0.725277 -1.79076
C  4.05864 0.950112 -0.433795
C  2.636176 0.455817 -0.544751
C  3.040278 1.921282 -2.611563
C  3.979969 -0.417226 -2.627593
C  4.31721 2.302157 0.107779
C  2.302697 -0.917372 -0.104238
C  5.512012 2.817151 0.403824
C  5.637375 4.198456 0.973673
C  6.81132 2.097544 0.205799
C  0.519539 -2.293072 0.597585
C  -0.957032 -2.204363 0.709589
C  -1.905534 -2.090906 -0.355618
C  -1.691603 -2.211667 1.845108
C  -3.128398 -2.041574 0.221497
C  -4.50107 -1.890762 -0.328884
C  -5.120043 -0.561505 0.031903
C  -5.977704 -0.445869 1.11841
C  -4.81087 0.578371 -0.70249
C  -6.521019 0.78353 1.462831
C  -5.353192 1.807516 -0.363542
C  -6.211204 1.913465 0.721919
H  4.75917 0.179248 -0.129568
H  1.854392 1.182813 -0.351449
H  2.280384 1.637413 -3.341846
H  3.893815 2.326651 -3.157996
H  2.630518 2.72761 -2.004595
H  4.330706 -1.254373 -2.029219
H  4.814257 -0.071557 -3.241057
H  3.207777 -0.788626 -3.304679
H  3.443888 2.923454 0.285158
H  4.669359 4.684171 1.090829
H  6.121211 4.176598 1.953534
H  6.257033 4.833386 0.335438
H  7.467836 2.670718 -0.453571
H  7.344304 1.988178 1.153585
H  6.696914 1.107387 -0.229377
H  0.970951 -2.538559 1.562299
H  0.813565 -3.077183 -0.104437
H  -1.694161 -2.046406 -1.411982
H  -1.421314 -2.280339 2.886587
H  -5.138603 -2.706444 0.024021
H  -4.439969 -1.995145 -1.413671
H  -6.222734 -1.324708 1.702457
H  -4.134798 0.502786 -1.546172
H  -7.188021 0.857869 2.311814
H  -5.106467 2.68446 -0.947698
H  -6.635931 2.872443 0.987787
totalener: -1079.73282027 hartree
nucrepener: 2012.38460120 hartree
electener: -3092.11742147 hartree
oneelecener: -5462.93397169 hartree
twoeener: 2370.81655022 hartree
kineticenergy: 1074.90925152 hartree
xcener: -106.464081227696 hartree
chargesum: -0.0000000
charge: -0.250622 -0.389834 -0.251817 0.115010 0.023468 -0.119824 -0.231424 -0.269374 -0.192805 0.336146 -0.035597 -0.207984 -0.237133 0.053017 -0.031716 -0.262419 -0.024733 0.210562 -0.138987 0.092336 -0.151440 -0.165912 -0.123462 -0.122918 -0.134284 0.092744 0.073674 0.089545 0.088746 0.072870 0.102012 0.084443 0.083796 0.078037 0.077261 0.085384 0.082634 0.083621 0.088209 0.082835 0.091207 0.101634 0.125579 0.136434 0.102535 0.103332 0.106622 0.106569 0.123512 0.123823 0.124689
qa: -0.2506 -0.3898 -0.2518 0.1150 0.0235 -0.1198 -0.2314 -0.2694 -0.1928 0.3361 -0.0356 -0.2080 -0.2371 0.0530 -0.0317 -0.2624 -0.0247 0.2106 -0.1390 0.0923 -0.1514 -0.1659 -0.1235 -0.1229 -0.1343 0.0927 0.0737 0.0895 0.0887 0.0729 0.1020 0.0844 0.0838 0.0780 0.0773 0.0854 0.0826 0.0836 0.0882 0.0828 0.0912 0.1016 0.1256 0.1364 0.1025 0.1033 0.1066 0.1066 0.1235 0.1238 0.1247
va: 2.1307 2.1156 2.3137 3.7225 3.7623 3.9459 3.9072 3.9115 3.8991 4.2270 3.7846 3.9382 3.9488 3.8776 3.7373 4.0404 3.9785 3.6416 3.8901 3.6055 4.0114 4.0074 3.9589 3.9658 3.9623 1.0332 1.0393 1.0048 1.0059 1.0101 1.0216 1.0019 1.0025 1.0185 1.0118 0.9979 0.9985 0.9997 0.9992 1.0130 1.0036 0.9958 1.0183 1.0074 1.0078 1.0096 1.0138 1.0118 1.0004 1.0004 0.9999
dispcorr: -0.021076908 hartree
energy: -1079.753897176616
dipole: 27.75849 -28.07722 -0.31873 17.59875 -17.08190 0.51685 -8.81682 8.54639 -0.27043
magnitude: 0.66472 au
magnitude: 1.68960 debye
