program: Orca
programVersion: 5.0.2
elementType: O O O C C C C C C C C C C C C C C C C C C C H H H H H H H H H H H H H H H H H H H H H H H H
charge: 0
multiplicity: 1
keywords: wb97x-d3
keywords: def2-TZVPP
keywords: def2/J RIJCOSX
keywords: DEFGRID2
keywords: scfconv7
keywords: smallprint printgap noloewdin
keywords: NOSOSCF
formula: C19H24O3
InChI: InChI=1/C19H24O3/c1-7-8-13-12(4)16(10-15(13)20)22-18(21)17-14(9-11(2)3)19(17,5)6/h1,9,14,16-17H,8,10H2,2-6H3
46 atoms
O  -0.583016 -0.556717 1.730802
O  -0.158206 0.356816 -0.264465
O  3.701491 -1.774669 0.154083
C  -3.197575 1.085023 -0.270048
C  -3.093498 -0.251954 -0.912244
C  -2.421399 -0.010441 0.442757
C  -2.496393 2.281276 -0.86306
C  -4.514069 1.441127 0.379142
C  -2.325762 -0.476114 -2.162401
C  -0.958365 -0.026674 0.556483
C  -1.723011 -1.618762 -2.499702
C  0.804058 -0.765006 1.989824
C  -1.01708 -1.771233 -3.811315
C  -1.686191 -2.823325 -1.612369
C  1.481037 -1.831951 1.134184
C  1.665739 0.461529 1.841062
C  2.808736 0.179293 1.197342
C  2.798671 -1.208387 0.741432
C  1.262292 1.769888 2.406928
C  3.928709 1.129869 0.902062
C  3.533319 2.114624 -0.098417
C  3.174394 2.92002 -0.916134
H  -3.972912 -0.881756 -0.804994
H  -2.930228 -0.453317 1.290477
H  -2.249119 3.003903 -0.083385
H  -1.581249 2.043789 -1.397722
H  -3.165872 2.778397 -1.567737
H  -5.005978 0.567511 0.808203
H  -4.373763 2.172028 1.177525
H  -5.19339 1.87746 -0.355611
H  -2.29017 0.350905 -2.865816
H  0.815451 -1.060152 3.041348
H  0.912826 -2.082075 0.23495
H  1.642063 -2.764796 1.675662
H  -1.435866 -2.599328 -4.388882
H  -1.080058 -0.869798 -4.420381
H  0.039819 -2.005447 -3.660043
H  -2.200912 -3.665436 -2.082444
H  -0.654901 -3.147955 -1.449488
H  -2.142548 -2.655885 -0.638266
H  2.126649 2.362446 2.705925
H  0.606289 1.650159 3.268579
H  0.715466 2.351135 1.65993
H  4.238901 1.649322 1.812687
H  4.803876 0.581275 0.547572
H  2.86796 3.637429 -1.643749
elementType: O C H
totalener: -964.15729235 hartree
nucrepener: 1857.26194291 hartree
electener: -2821.41923526 hartree
oneelecener: -5000.55318263 hartree
twoeener: 2179.13394738 hartree
cpcmener: -0.04428614 hartree
kineticenergy: 959.78178233 hartree
xcener: -94.703303877228 hartree
chargesum: -0.0000000
charge: -0.309418 -0.486781 -0.489810 0.135150 -0.009850 -0.127343 -0.303680 -0.264877 -0.284306 0.408436 -0.013023 0.302468 -0.225238 -0.283765 -0.156361 0.013031 -0.151039 0.311329 -0.278212 -0.099602 -0.442432 0.013235 0.118177 0.094997 0.100920 0.095191 0.102282 0.088398 0.095889 0.094518 0.125018 0.123048 0.112812 0.109976 0.096391 0.089464 0.095937 0.116445 0.094900 0.096306 0.119162 0.118887 0.115964 0.136614 0.109408 0.291386
qa: -0.3094 -0.4868 -0.4898 0.1351 -0.0099 -0.1273 -0.3037 -0.2649 -0.2843 0.4084 -0.0130 0.3025 -0.2252 -0.2838 -0.1564 0.0130 -0.1510 0.3113 -0.2782 -0.0996 -0.4424 0.0132 0.1182 0.0950 0.1009 0.0952 0.1023 0.0884 0.0959 0.0945 0.1250 0.1230 0.1128 0.1100 0.0964 0.0895 0.0959 0.1164 0.0949 0.0963 0.1192 0.1189 0.1160 0.1366 0.1094 0.2914
va: 2.1212 2.0032 2.0106 3.7309 3.8157 3.8583 3.9011 3.8985 3.8626 4.0656 3.6866 3.7675 3.9242 3.9441 3.8804 3.6539 3.5283 4.0369 3.9357 3.8865 3.8039 3.5672 1.0031 1.0331 1.0008 1.0140 0.9986 1.0049 1.0021 1.0019 0.9992 0.9914 1.0229 1.0240 0.9957 1.0071 0.9968 0.9990 0.9969 1.0054 0.9958 1.0053 0.9981 0.9899 1.0208 0.9446
dispcorr: -0.024519895 hartree
energy: -964.181812244667
dipole: -18.55520 16.24220 -2.31300 2.44837 -1.94129 0.50708 -6.67517 8.61150 1.93633
magnitude: 3.05884 au
magnitude: 7.77495 debye
