program: Orca
programVersion: 5.0.2
elementType: O O O C C C C C C C C C C C C C C C C C C C H H H H H H H H H H H H H H H H H H H H H H H H
charge: 0
multiplicity: 1
keywords: wb97x-d3
keywords: def2-TZVPP
keywords: def2/J RIJCOSX
keywords: DEFGRID2
keywords: scfconv7
keywords: smallprint printgap noloewdin
keywords: NOSOSCF
formula: C19H24O3
InChI: InChI=1/C19H24O3/c1-7-8-13-12(4)16(10-15(13)20)22-18(21)17-14(9-11(2)3)19(17,5)6/h1,9,14,16-17H,8,10H2,2-6H3
46 atoms
O  0.323215 -0.491198 0.561327
O  -1.419243 0.824622 1.06391
O  4.100756 -1.022798 3.170148
C  -3.06366 -1.443288 -0.342843
C  -2.781049 -0.465971 -1.439697
C  -1.640412 -0.950123 -0.545192
C  -3.871525 -1.02759 0.860423
C  -3.296887 -2.879822 -0.745021
C  -3.28141 0.924496 -1.444492
C  -0.950086 -0.09516 0.434305
C  -4.012832 1.465547 -2.425547
C  1.199886 0.180257 1.4667
C  -4.450411 2.897868 -2.356529
C  -4.450465 0.738683 -3.662879
C  1.778897 -0.774747 2.502395
C  2.389308 0.69346 0.699476
C  3.543444 0.302217 1.259535
C  3.27076 -0.559094 2.413188
C  2.200817 1.540213 -0.500014
C  4.933488 0.6465 0.815351
C  5.326203 -0.10282 -0.372284
C  5.63328 -0.715583 -1.360062
H  -2.714509 -0.917359 -2.423516
H  -0.980849 -1.66666 -1.019469
H  -3.80536 0.030527 1.096845
H  -4.924114 -1.253118 0.67995
H  -3.56525 -1.589814 1.744387
H  -4.34773 -3.041131 -0.993134
H  -2.702911 -3.159133 -1.61591
H  -3.039058 -3.560739 0.068415
H  -3.039923 1.553329 -0.596432
H  0.684688 1.018465 1.939875
H  1.556476 -1.814328 2.250734
H  1.411864 -0.594551 3.512632
H  -4.109557 3.452942 -3.234569
H  -5.540747 2.974423 -2.350072
H  -4.070258 3.404321 -1.469638
H  -4.398773 -0.344724 -3.575235
H  -5.481825 0.997543 -3.909643
H  -3.84494 1.032026 -4.52439
H  1.845072 0.93646 -1.338153
H  3.122566 2.028758 -0.810506
H  1.442845 2.304314 -0.319333
H  5.01153 1.716237 0.6062
H  5.641638 0.439676 1.620984
H  5.91319 -1.255136 -2.236871
elementType: O C H
totalener: -964.15981516 hartree
nucrepener: 1745.41423321 hartree
electener: -2709.57404837 hartree
oneelecener: -4775.65669623 hartree
twoeener: 2066.08264785 hartree
cpcmener: -0.03842421 hartree
kineticenergy: 959.76142781 hartree
xcener: -94.697128074822 hartree
chargesum: -0.0000000
charge: -0.302466 -0.496379 -0.481196 0.136725 0.033490 -0.147155 -0.289490 -0.266961 -0.329857 0.437219 -0.009412 0.251098 -0.226352 -0.272691 -0.137519 -0.012489 -0.098715 0.320800 -0.261288 -0.103160 -0.457081 0.038453 0.115684 0.098432 0.095059 0.098224 0.105397 0.094440 0.089295 0.094154 0.125308 0.106106 0.102307 0.102446 0.094655 0.094006 0.088641 0.093318 0.093843 0.104146 0.114667 0.106475 0.119088 0.134819 0.111748 0.292173
qa: -0.3025 -0.4964 -0.4812 0.1367 0.0335 -0.1472 -0.2895 -0.2670 -0.3299 0.4372 -0.0094 0.2511 -0.2264 -0.2727 -0.1375 -0.0125 -0.0987 0.3208 -0.2613 -0.1032 -0.4571 0.0385 0.1157 0.0984 0.0951 0.0982 0.1054 0.0944 0.0893 0.0942 0.1253 0.1061 0.1023 0.1024 0.0947 0.0940 0.0886 0.0933 0.0938 0.1041 0.1147 0.1065 0.1191 0.1348 0.1117 0.2922
va: 2.1259 2.0000 2.0180 3.6903 3.7309 3.9441 3.9109 3.9125 3.8836 4.0587 3.7218 3.7598 3.9286 3.9463 3.9146 3.7181 3.5419 4.0254 3.9381 3.8802 3.8272 3.5350 1.0029 1.0308 1.0126 1.0017 0.9989 1.0018 1.0046 1.0022 1.0244 1.0361 1.0270 1.0240 0.9943 0.9964 1.0086 1.0053 0.9986 0.9947 1.0009 1.0015 1.0032 0.9891 1.0189 0.9437
dispcorr: -0.020937034 hartree
energy: -964.180752194929
dipole: -28.01136 26.56830 -1.44306 2.80188 -2.43840 0.36348 -15.98550 14.00776 -1.97774
magnitude: 2.47508 au
magnitude: 6.29115 debye
