program: Orca
programVersion: 5.0.2
elementType: O O O C C C C C C C C C C C C C C C C C C C H H H H H H H H H H H H H H H H H H H H H H H H
charge: 0
multiplicity: 1
keywords: wb97x-d3
keywords: def2-TZVPP
keywords: def2/J RIJCOSX
keywords: DEFGRID2
keywords: scfconv7
keywords: smallprint printgap noloewdin
keywords: NOSOSCF
formula: C19H24O3
InChI: InChI=1/C19H24O3/c1-7-8-13-12(4)16(10-15(13)20)22-18(21)17-14(9-11(2)3)19(17,5)6/h1,9,14,16-17H,8,10H2,2-6H3
46 atoms
O  0.260119 -0.605942 0.709311
O  -1.288662 1.005799 0.834381
O  4.184266 -1.096142 3.063384
C  -3.158358 -1.303671 -0.205744
C  -2.774889 -0.530943 -1.429138
C  -1.691908 -0.985827 -0.452776
C  -3.925661 -0.636714 0.908051
C  -3.531603 -2.754425 -0.39214
C  -3.144389 0.884957 -1.631578
C  -0.93126 -0.070113 0.412895
C  -3.779488 1.378324 -2.7008
C  1.162915 0.094173 1.568736
C  -4.106347 2.840148 -2.780973
C  -4.225323 0.579251 -3.887076
C  1.821552 -0.867546 2.548427
C  2.297512 0.668359 0.758908
C  3.488366 0.290977 1.246953
C  3.300206 -0.620301 2.378661
C  2.027251 1.544031 -0.40384
C  4.84785 0.671133 0.743988
C  5.259401 -0.180369 -0.365968
C  5.56868 -0.897727 -1.279742
H  -2.752989 -1.125046 -2.336228
H  -1.104778 -1.828039 -0.798748
H  -3.693799 -1.101127 1.86808
H  -3.742807 0.430192 0.99931
H  -4.99521 -0.766841 0.733336
H  -2.967759 -3.218511 -1.201987
H  -3.343026 -3.326795 0.518139
H  -4.593189 -2.84781 -0.629246
H  -2.895559 1.582856 -0.842628
H  0.640062 0.898103 2.090303
H  1.6041 -1.907512 2.29459
H  1.510015 -0.710284 3.581091
H  -3.669309 3.292761 -3.674881
H  -5.185841 2.995946 -2.853884
H  -3.744519 3.391536 -1.913358
H  -4.071581 -0.492673 -3.782387
H  -5.289619 0.741696 -4.073597
H  -3.703707 0.905158 -4.790835
H  1.579744 0.96778 -1.217225
H  2.93077 2.01312 -0.788124
H  1.312727 2.326061 -0.141514
H  4.860658 1.714799 0.422283
H  5.578775 0.589801 1.552093
H  5.857623 -1.516776 -2.099128
elementType: O C H
totalener: -964.16057685 hartree
nucrepener: 1750.48733925 hartree
electener: -2714.64791610 hartree
oneelecener: -4785.86914055 hartree
twoeener: 2071.22122445 hartree
cpcmener: -0.03869207 hartree
kineticenergy: 959.76485453 hartree
xcener: -94.698056750803 hartree
chargesum: 0.0000000
charge: -0.300689 -0.496511 -0.481038 0.117198 0.031874 -0.125269 -0.286878 -0.263511 -0.316902 0.426937 -0.033261 0.252105 -0.223938 -0.257508 -0.137013 -0.026075 -0.100267 0.319140 -0.243810 -0.106162 -0.445584 0.029198 0.115855 0.098338 0.105397 0.093681 0.099315 0.088882 0.093932 0.094943 0.128221 0.105913 0.103262 0.102766 0.092799 0.093983 0.089150 0.089771 0.094544 0.099103 0.115490 0.106611 0.116640 0.133194 0.114253 0.291920
qa: -0.3007 -0.4965 -0.4810 0.1172 0.0319 -0.1253 -0.2869 -0.2635 -0.3169 0.4269 -0.0333 0.2521 -0.2239 -0.2575 -0.1370 -0.0261 -0.1003 0.3191 -0.2438 -0.1062 -0.4456 0.0292 0.1159 0.0983 0.1054 0.0937 0.0993 0.0889 0.0939 0.0949 0.1282 0.1059 0.1033 0.1028 0.0928 0.0940 0.0892 0.0898 0.0945 0.0991 0.1155 0.1066 0.1166 0.1332 0.1143 0.2919
va: 2.1272 1.9952 2.0173 3.7100 3.7338 3.9269 3.9104 3.9095 3.8514 4.0716 3.7520 3.7582 3.9245 3.9412 3.9106 3.7519 3.5323 4.0299 3.9331 3.8830 3.8250 3.5460 1.0049 1.0305 0.9989 1.0122 1.0016 1.0051 1.0021 1.0016 1.0229 1.0338 1.0283 1.0232 0.9956 0.9966 1.0084 1.0111 0.9974 0.9962 1.0000 1.0028 1.0062 0.9908 1.0157 0.9440
dispcorr: -0.021053849 hartree
energy: -964.181630695554
dipole: -28.16614 26.49171 -1.67443 3.32743 -3.06351 0.26392 -15.72548 14.09923 -1.62625
magnitude: 2.34906 au
magnitude: 5.97083 debye
