program: Orca
programVersion: 5.0.2
elementType: O O O C C C C C C C C C C C C C C C C C C C H H H H H H H H H H H H H H H H H H H H H H H H
charge: 0
multiplicity: 1
keywords: wb97x-d3
keywords: def2-TZVPP
keywords: def2/J RIJCOSX
keywords: DEFGRID2
keywords: scfconv7
keywords: smallprint printgap noloewdin
keywords: NOSOSCF
formula: C19H24O3
InChI: InChI=1/C19H24O3/c1-7-8-13-12(4)16(10-15(13)20)22-18(21)17-14(9-11(2)3)19(17,5)6/h1,9,14,16-17H,8,10H2,2-6H3
46 atoms
O  -0.519056 -0.296697 0.353639
O  -1.391618 -0.412837 2.408116
O  3.861481 -0.894254 -0.996658
C  -3.168355 1.027948 -0.432468
C  -3.232019 -0.403092 -0.838324
C  -2.850855 -0.04855 0.5973
C  -2.095166 1.937893 -0.97843
C  -4.474815 1.748775 -0.196768
C  -2.293245 -1.001933 -1.821859
C  -1.53221 -0.267484 1.211566
C  -1.920541 -2.283226 -1.841962
C  0.817173 -0.479281 0.822099
C  -0.999594 -2.811688 -2.898012
C  -2.34638 -3.278599 -0.808353
C  1.613107 -1.309787 -0.17533
C  1.540704 0.842932 0.89558
C  2.707002 0.797238 0.23412
C  2.876443 -0.515044 -0.394176
C  0.991577 1.976007 1.674915
C  3.744533 1.875357 0.138671
C  4.547704 1.967112 1.35227
C  5.188723 2.03659 2.36675
H  -4.236938 -0.816644 -0.880113
H  -3.636588 -0.208169 1.326412
H  -1.845191 2.71557 -0.254373
H  -1.17514 1.430622 -1.254472
H  -2.470031 2.436565 -1.874345
H  -5.242531 1.082049 0.197388
H  -4.346969 2.568167 0.513023
H  -4.849826 2.174046 -1.129682
H  -1.913967 -0.343316 -2.598243
H  0.809679 -0.947689 1.808548
H  1.084526 -1.400288 -1.128128
H  1.831074 -2.31797 0.176143
H  -0.693889 -2.037411 -3.601216
H  -0.097549 -3.238274 -2.451207
H  -1.472105 -3.617553 -3.465477
H  -2.80428 -4.153894 -1.275477
H  -1.478434 -3.646702 -0.254143
H  -3.054764 -2.875059 -0.087239
H  1.630802 2.855102 1.631229
H  0.871335 1.691396 2.722291
H  0.002511 2.261221 1.310171
H  4.400181 1.684627 -0.713664
H  3.269984 2.841038 -0.051175
H  5.758593 2.099381 3.266505
elementType: O C H
totalener: -964.15726759 hartree
nucrepener: 1843.09248474 hartree
electener: -2807.24975233 hartree
oneelecener: -4970.47304064 hartree
twoeener: 2163.22328831 hartree
cpcmener: -0.04074698 hartree
kineticenergy: 959.77679485 hartree
xcener: -94.701443565398 hartree
chargesum: -0.0000000
charge: -0.259849 -0.503192 -0.481379 0.143793 -0.014393 -0.149907 -0.324754 -0.268799 -0.247993 0.431652 -0.049111 0.192630 -0.237417 -0.265781 -0.121309 -0.006036 -0.096776 0.323231 -0.247990 -0.119440 -0.454403 0.042306 0.115850 0.094716 0.105695 0.094033 0.109189 0.088131 0.096383 0.093846 0.125015 0.113683 0.096477 0.105272 0.094746 0.089335 0.108930 0.106911 0.098683 0.093442 0.101992 0.120149 0.120734 0.114340 0.135454 0.291911
qa: -0.2598 -0.5032 -0.4814 0.1438 -0.0144 -0.1499 -0.3248 -0.2688 -0.2480 0.4317 -0.0491 0.1926 -0.2374 -0.2658 -0.1213 -0.0060 -0.0968 0.3232 -0.2480 -0.1194 -0.4544 0.0423 0.1159 0.0947 0.1057 0.0940 0.1092 0.0881 0.0964 0.0938 0.1250 0.1137 0.0965 0.1053 0.0947 0.0893 0.1089 0.1069 0.0987 0.0934 0.1020 0.1201 0.1207 0.1143 0.1355 0.2919
va: 2.1016 1.9902 2.0194 3.7066 3.8054 3.8696 3.9067 3.9039 3.8293 4.0882 3.7025 3.7918 3.9154 3.9467 3.9094 3.7142 3.5167 4.0540 3.9419 3.8887 3.8196 3.5317 1.0042 1.0277 0.9970 1.0078 1.0012 1.0055 1.0012 1.0020 0.9992 1.0327 1.0326 1.0221 1.0053 0.9953 0.9977 0.9999 0.9965 1.0046 1.0039 1.0025 0.9952 1.0159 0.9891 0.9437
dispcorr: -0.025313662 hartree
energy: -964.182581248181
dipole: -18.47156 16.52598 -1.94558 0.47381 0.44387 0.91768 -8.06714 7.62007 -0.44706
magnitude: 2.19711 au
magnitude: 5.58461 debye
