program: Orca
programVersion: 5.0.2
elementType: O O O C C C C C C C C C C C C C C C C C C C H H H H H H H H H H H H H H H H H H H H H H H H
charge: 0
multiplicity: 1
keywords: wb97x-d3
keywords: def2-TZVPP
keywords: def2/J RIJCOSX
keywords: DEFGRID2
keywords: scfconv7
keywords: smallprint printgap noloewdin
keywords: NOSOSCF
formula: C19H24O3
InChI: InChI=1/C19H24O3/c1-7-8-13-12(4)16(10-15(13)20)22-18(21)17-14(9-11(2)3)19(17,5)6/h1,9,14,16-17H,8,10H2,2-6H3
46 atoms
O  -0.642038 -0.016527 1.053041
O  -1.808529 -1.571416 2.139437
O  3.259465 -2.126085 0.136818
C  -3.258895 0.985711 -0.132854
C  -2.690594 -0.015452 -1.076819
C  -2.876479 -0.384548 0.401793
C  -2.495703 2.232795 0.239587
C  -4.750185 1.223497 -0.198542
C  -1.354615 0.143454 -1.705673
C  -1.748171 -0.70906 1.286543
C  -0.605261 -0.858574 -2.171743
C  0.558162 -0.394827 1.734357
C  0.720206 -0.604098 -2.821109
C  -1.006792 -2.298028 -2.075121
C  1.138881 -1.718914 1.246466
C  1.580322 0.64411 1.35654
C  2.638695 0.101307 0.738855
C  2.465682 -1.348453 0.628528
C  1.353205 2.079125 1.645831
C  3.833726 0.825056 0.196949
C  3.479371 1.674289 -0.93422
C  3.155019 2.377093 -1.854423
H  -3.421429 -0.522517 -1.70132
H  -3.718429 -1.036338 0.603154
H  -2.784731 3.043157 -0.43237
H  -2.746883 2.547105 1.25418
H  -1.415611 2.136265 0.179994
H  -4.981685 1.983055 -0.947538
H  -5.296078 0.31754 -0.464123
H  -5.132905 1.575538 0.761137
H  -0.978015 1.156646 -1.81194
H  0.388507 -0.387223 2.814279
H  0.512871 -2.210643 0.498937
H  1.289653 -2.431009 2.058734
H  1.52621 -1.088223 -2.262346
H  0.752929 -1.022613 -3.830435
H  0.948433 0.459611 -2.888552
H  -1.863956 -2.459984 -1.422435
H  -1.258709 -2.697504 -3.062316
H  -0.178395 -2.905743 -1.70068
H  2.289471 2.631946 1.716108
H  0.798071 2.211179 2.574823
H  0.763214 2.538883 0.848478
H  4.287115 1.442814 0.977193
H  4.597871 0.10736 -0.109612
H  2.866175 3.001555 -2.670197
elementType: O C H
totalener: -964.15765472 hartree
nucrepener: 1900.28936102 hartree
electener: -2864.44701574 hartree
oneelecener: -5085.34755234 hartree
twoeener: 2220.90053660 hartree
cpcmener: -0.04066052 hartree
kineticenergy: 959.77538901 hartree
xcener: -94.700697780741 hartree
chargesum: 0.0000000
charge: -0.263077 -0.504058 -0.483723 0.143770 -0.014883 -0.140602 -0.273319 -0.271376 -0.246326 0.416960 -0.031905 0.221432 -0.240262 -0.284176 -0.135910 -0.013727 -0.090565 0.293013 -0.303612 -0.066949 -0.449677 0.002821 0.115476 0.093874 0.101208 0.105344 0.062132 0.094617 0.088324 0.096264 0.125536 0.116172 0.114148 0.119871 0.087804 0.111487 0.085414 0.098390 0.117247 0.093800 0.119785 0.122587 0.126972 0.137417 0.109852 0.292429
qa: -0.2631 -0.5041 -0.4837 0.1438 -0.0149 -0.1406 -0.2733 -0.2714 -0.2463 0.4170 -0.0319 0.2214 -0.2403 -0.2842 -0.1359 -0.0137 -0.0906 0.2930 -0.3036 -0.0669 -0.4497 0.0028 0.1155 0.0939 0.1012 0.1053 0.0621 0.0946 0.0883 0.0963 0.1255 0.1162 0.1141 0.1199 0.0878 0.1115 0.0854 0.0984 0.1172 0.0938 0.1198 0.1226 0.1270 0.1374 0.1099 0.2924
va: 2.1093 1.9942 2.0031 3.7413 3.7864 3.8804 3.9052 3.9047 3.8157 4.1026 3.6785 3.7833 3.9221 3.9427 3.8830 3.7285 3.5156 3.9926 3.9460 3.8544 3.8134 3.5787 1.0031 1.0275 1.0008 1.0009 1.0095 1.0019 1.0051 1.0016 0.9985 1.0131 1.0164 1.0187 1.0000 1.0000 1.0072 1.0033 0.9983 0.9974 0.9976 1.0025 0.9848 0.9898 1.0225 0.9446
dispcorr: -0.027877837 hartree
energy: -964.185532560306
dipole: -12.08515 11.13682 -0.94832 8.07744 -5.82965 2.24779 -8.57518 8.66146 0.08628
magnitude: 2.44117 au
magnitude: 6.20497 debye
