program: Orca
programVersion: 5.0.2
elementType: O O O C C C C C C C C C C C C C C C C C C C H H H H H H H H H H H H H H H H H H H H H H H H
charge: 0
multiplicity: 1
keywords: wb97x-d3
keywords: def2-TZVPP
keywords: def2/J RIJCOSX
keywords: DEFGRID2
keywords: scfconv7
keywords: smallprint printgap noloewdin
keywords: NOSOSCF
formula: C19H24O3
InChI: InChI=1/C19H24O3/c1-7-8-13-12(4)16(10-15(13)20)22-18(21)17-14(9-11(2)3)19(17,5)6/h1,9,14,16-17H,8,10H2,2-6H3
46 atoms
O  0.344753 -0.390529 0.412072
O  -1.490964 0.580595 1.245732
O  4.012892 -0.982029 3.171585
C  -3.044704 -1.552025 -0.406668
C  -2.815735 -0.472428 -1.417585
C  -1.646818 -0.986164 -0.574678
C  -3.864726 -1.278913 0.829133
C  -3.224537 -2.95564 -0.935168
C  -3.357719 0.89543 -1.293174
C  -0.976077 -0.171995 0.454547
C  -4.077064 1.519402 -2.232853
C  1.200833 0.259366 1.350583
C  -4.555379 2.925434 -2.027433
C  -4.461127 0.919254 -3.553341
C  1.720298 -0.692594 2.421684
C  2.42816 0.734037 0.619651
C  3.552062 0.326822 1.226048
C  3.22103 -0.513953 2.382597
C  2.302188 1.573203 -0.59434
C  4.965557 0.644426 0.839842
C  5.382293 -0.051265 -0.371813
C  5.708253 -0.619561 -1.379543
H  -2.742378 -0.830874 -2.438394
H  -0.960754 -1.623618 -1.119834
H  -4.907014 -1.536546 0.629901
H  -3.530195 -1.899783 1.662483
H  -3.846293 -0.243649 1.156918
H  -2.633291 -3.1312 -1.835032
H  -2.925461 -3.697274 -0.19147
H  -4.271248 -3.14037 -1.185786
H  -3.154449 1.436134 -0.376244
H  0.690096 1.118698 1.791439
H  1.481066 -1.730304 2.176008
H  1.322554 -0.490484 3.416426
H  -4.210484 3.348106 -1.083839
H  -4.20904 3.577637 -2.834279
H  -5.647628 2.975716 -2.041274
H  -5.497529 1.163998 -3.796062
H  -3.850794 1.3295 -4.363239
H  -4.368798 -0.164967 -3.587256
H  3.238423 2.06197 -0.85861
H  1.535499 2.338651 -0.46094
H  1.993907 0.964542 -1.447889
H  5.083969 1.720844 0.689153
H  5.637624 0.374589 1.658091
H  6.013073 -1.126085 -2.267666
elementType: O C H
totalener: -964.17043625 hartree
nucrepener: 1743.64465546 hartree
electener: -2707.81509171 hartree
oneelecener: -4772.09610621 hartree
twoeener: 2064.28101450 hartree
cpcmener: -0.03139643 hartree
kineticenergy: 959.75729496 hartree
xcener: -94.693407641335 hartree
chargesum: -0.0000000
charge: -0.299070 -0.469790 -0.444051 0.130555 0.035779 -0.136151 -0.285709 -0.264119 -0.317490 0.415250 -0.015537 0.235609 -0.223377 -0.272049 -0.129412 -0.015101 -0.083476 0.293943 -0.272416 -0.106807 -0.454125 0.043808 0.110682 0.095715 0.095426 0.102634 0.097361 0.087150 0.093723 0.093685 0.122472 0.105140 0.099192 0.100349 0.087719 0.092891 0.093334 0.092937 0.102995 0.092543 0.103708 0.117538 0.114358 0.132477 0.112366 0.287339
qa: -0.2991 -0.4698 -0.4441 0.1306 0.0358 -0.1362 -0.2857 -0.2641 -0.3175 0.4153 -0.0155 0.2356 -0.2234 -0.2720 -0.1294 -0.0151 -0.0835 0.2939 -0.2724 -0.1068 -0.4541 0.0438 0.1107 0.0957 0.0954 0.1026 0.0974 0.0872 0.0937 0.0937 0.1225 0.1051 0.0992 0.1003 0.0877 0.0929 0.0933 0.0929 0.1030 0.0925 0.1037 0.1175 0.1144 0.1325 0.1124 0.2873
va: 2.1248 2.0308 2.0638 3.6952 3.7421 3.9298 3.9085 3.9117 3.8931 4.0776 3.7325 3.7770 3.9293 3.9466 3.9017 3.6975 3.5311 4.0636 3.9492 3.8819 3.8323 3.5345 1.0049 1.0306 1.0019 0.9995 1.0136 1.0049 1.0024 1.0021 1.0246 1.0317 1.0269 1.0252 1.0091 0.9947 0.9965 0.9987 0.9947 1.0060 1.0015 1.0013 1.0000 0.9883 1.0198 0.9468
dispcorr: -0.020807440 hartree
energy: -964.191243685642
dipole: -27.67651 26.43320 -1.24331 2.89711 -2.39140 0.50571 -15.93524 13.90384 -2.03140
magnitude: 2.43478 au
magnitude: 6.18871 debye
