program: Orca
programVersion: 5.0.2
elementType: O O O C C C C C C C C C C C C C C C C C C C H H H H H H H H H H H H H H H H H H H H H H H H
charge: 0
multiplicity: 1
keywords: wb97x-d3
keywords: def2-TZVPP
keywords: def2/J RIJCOSX
keywords: DEFGRID2
keywords: scfconv7
keywords: smallprint printgap noloewdin
keywords: NOSOSCF
formula: C19H24O3
InChI: InChI=1/C19H24O3/c1-7-8-13-12(4)16(10-15(13)20)22-18(21)17-14(9-11(2)3)19(17,5)6/h1,9,14,16-17H,8,10H2,2-6H3
46 atoms
O  0.256358 -0.599132 0.694913
O  -1.284421 1.019186 0.807254
O  4.153214 -1.062299 3.11235
C  -3.154642 -1.306712 -0.197897
C  -2.789994 -0.530583 -1.425524
C  -1.694036 -0.981226 -0.463995
C  -3.907839 -0.644615 0.9291
C  -3.525996 -2.758475 -0.38116
C  -3.166174 0.883638 -1.624084
C  -0.931801 -0.060271 0.395982
C  -3.787051 1.381611 -2.699371
C  1.158212 0.100529 1.553877
C  -4.121251 2.841824 -2.775086
C  -4.210902 0.589941 -3.899158
C  1.801345 -0.857516 2.545441
C  2.303012 0.659158 0.748522
C  3.486829 0.283766 1.254161
C  3.28303 -0.605649 2.402753
C  2.049256 1.521469 -0.428503
C  4.852808 0.653873 0.762103
C  5.258912 -0.175628 -0.365932
C  5.568853 -0.869792 -1.296872
H  -2.778075 -1.124786 -2.332658
H  -1.103476 -1.818937 -0.815987
H  -3.673844 -1.122867 1.882311
H  -3.71074 0.418628 1.033787
H  -4.980565 -0.759636 0.761348
H  -2.972816 -3.221819 -1.199406
H  -3.322331 -3.332947 0.525115
H  -4.590686 -2.856975 -0.603613
H  -2.931701 1.576203 -0.82609
H  0.635713 0.912773 2.063889
H  1.591865 -1.898044 2.284985
H  1.470237 -0.705362 3.573101
H  -3.665188 3.304155 -3.655048
H  -5.19952 2.995039 -2.871859
H  -3.782965 3.390111 -1.895546
H  -4.000891 -0.474366 -3.826386
H  -5.285019 0.699532 -4.06754
H  -3.720917 0.96507 -4.800867
H  1.610037 0.938608 -1.241845
H  2.958925 1.982897 -0.808341
H  1.335488 2.31116 -0.186482
H  4.882527 1.705159 0.466215
H  5.578965 0.542387 1.571001
H  5.838439 -1.493678 -2.118799
elementType: O C H
totalener: -964.17096243 hartree
nucrepener: 1750.57044602 hartree
electener: -2714.74140844 hartree
oneelecener: -4785.98132380 hartree
twoeener: 2071.23991536 hartree
cpcmener: -0.03151874 hartree
kineticenergy: 959.77801512 hartree
xcener: -94.698272152795 hartree
chargesum: 0.0000000
charge: -0.295534 -0.471380 -0.444893 0.109387 0.028067 -0.115492 -0.284239 -0.261195 -0.302772 0.404798 -0.040993 0.247299 -0.221716 -0.255055 -0.133614 -0.031427 -0.092706 0.291557 -0.243998 -0.111616 -0.444454 0.038320 0.113857 0.095936 0.102892 0.095570 0.098236 0.086793 0.093358 0.094758 0.127317 0.103775 0.100604 0.099339 0.091595 0.092587 0.088733 0.087737 0.094664 0.096602 0.114191 0.104746 0.116179 0.131050 0.113994 0.287142
qa: -0.2955 -0.4714 -0.4449 0.1094 0.0281 -0.1155 -0.2842 -0.2612 -0.3028 0.4048 -0.0410 0.2473 -0.2217 -0.2551 -0.1336 -0.0314 -0.0927 0.2916 -0.2440 -0.1116 -0.4445 0.0383 0.1139 0.0959 0.1029 0.0956 0.0982 0.0868 0.0934 0.0948 0.1273 0.1038 0.1006 0.0993 0.0916 0.0926 0.0887 0.0877 0.0947 0.0966 0.1142 0.1047 0.1162 0.1311 0.1140 0.2871
va: 2.1266 2.0248 2.0618 3.7159 3.7424 3.9076 3.9116 3.9091 3.8491 4.1051 3.7645 3.7640 3.9250 3.9407 3.8966 3.7462 3.5141 4.0643 3.9342 3.8861 3.8329 3.5452 1.0049 1.0308 0.9992 1.0130 1.0017 1.0054 1.0024 1.0016 1.0241 1.0347 1.0289 1.0246 0.9960 0.9966 1.0087 1.0127 0.9974 0.9967 1.0004 1.0028 1.0064 0.9900 1.0165 0.9469
dispcorr: -0.021027527 hartree
energy: -964.191989954792
dipole: -28.04699 26.48053 -1.56646 3.17817 -2.97252 0.20565 -15.73566 14.20676 -1.52890
magnitude: 2.19855 au
magnitude: 5.58828 debye
