program: Orca
programVersion: 5.0.2
elementType: O O O C C C C C C C C C C C C C C C C C C C H H H H H H H H H H H H H H H H H H H H H H H H
charge: 0
multiplicity: 1
keywords: wb97x-d3
keywords: def2-TZVPP
keywords: def2/J RIJCOSX
keywords: DEFGRID2
keywords: scfconv7
keywords: smallprint printgap noloewdin
keywords: NOSOSCF
formula: C19H24O3
InChI: InChI=1/C19H24O3/c1-7-8-13-12(4)16(10-15(13)20)22-18(21)17-14(9-11(2)3)19(17,5)6/h1,9,14,16-17H,8,10H2,2-6H3
46 atoms
O  -0.153983 -0.726064 0.947828
O  -1.399802 1.135441 0.892847
O  3.992601 -1.43208 2.834002
C  -3.724566 -0.746651 0.073888
C  -3.075801 -0.327199 -1.198556
C  -2.21993 -0.901694 -0.062552
C  -4.326145 0.266242 1.016962
C  -4.488433 -2.050388 0.061248
C  -2.972129 1.089595 -1.624063
C  -1.259084 -0.035546 0.634226
C  -2.12761 1.543372 -2.554116
C  0.91661 -0.068003 1.627308
C  -2.124896 2.982709 -2.968723
C  -1.127563 0.677324 -3.256838
C  1.611004 -1.034983 2.576597
C  1.987405 0.359332 0.65397
C  3.195761 -0.087073 1.026897
C  3.076414 -0.918728 2.228829
C  1.664027 1.180093 -0.53637
C  4.510752 0.174247 0.354943
C  4.622667 -0.517446 -0.923412
C  4.687403 -1.079774 -1.983889
H  -3.17173 -1.035735 -2.016728
H  -1.87047 -1.91611 -0.21464
H  -3.852288 1.242962 0.989494
H  -5.380942 0.407209 0.771991
H  -4.277424 -0.095153 2.046046
H  -4.528267 -2.490315 1.059843
H  -5.51609 -1.888563 -0.270871
H  -4.037172 -2.784469 -0.607644
H  -3.658987 1.795751 -1.16787
H  0.537701 0.807202 2.160259
H  1.284544 -2.06381 2.406349
H  1.438031 -0.807125 3.628757
H  -1.158647 3.448629 -2.7563
H  -2.285237 3.084302 -4.045571
H  -2.89551 3.560576 -2.458394
H  -1.027109 -0.313402 -2.815563
H  -1.400078 0.54664 -4.308491
H  -0.14057 1.146898 -3.254083
H  1.143347 0.571783 -1.281132
H  2.555369 1.586667 -1.011683
H  1.000161 2.007065 -0.280807
H  4.647526 1.2475 0.196363
H  5.32661 -0.143473 1.008713
H  4.746259 -1.576664 -2.926008
elementType: O C H
totalener: -964.16994676 hartree
nucrepener: 1803.03163894 hartree
electener: -2767.20158570 hartree
oneelecener: -4890.94800075 hartree
twoeener: 2123.74641505 hartree
cpcmener: -0.03170596 hartree
kineticenergy: 959.76605943 hartree
xcener: -94.695810921122 hartree
chargesum: -0.0000000
charge: -0.294804 -0.462887 -0.445760 0.130447 -0.026728 -0.091336 -0.298815 -0.262462 -0.246496 0.371057 -0.016983 0.242016 -0.224352 -0.301181 -0.130358 0.002187 -0.093872 0.283403 -0.290701 -0.104534 -0.455309 0.040488 0.113150 0.092332 0.093382 0.099484 0.101543 0.095509 0.094252 0.086910 0.121225 0.103347 0.101802 0.099215 0.093418 0.094707 0.088506 0.096466 0.117385 0.093191 0.127651 0.109837 0.121011 0.132913 0.112080 0.287658
qa: -0.2948 -0.4629 -0.4458 0.1304 -0.0267 -0.0913 -0.2988 -0.2625 -0.2465 0.3711 -0.0170 0.2420 -0.2244 -0.3012 -0.1304 0.0022 -0.0939 0.2834 -0.2907 -0.1045 -0.4553 0.0405 0.1132 0.0923 0.0934 0.0995 0.1015 0.0955 0.0943 0.0869 0.1212 0.1033 0.1018 0.0992 0.0934 0.0947 0.0885 0.0965 0.1174 0.0932 0.1277 0.1098 0.1210 0.1329 0.1121 0.2877
va: 2.1243 2.0238 2.0619 3.7590 3.8091 3.8424 3.8985 3.8956 3.8423 4.1188 3.6858 3.7959 3.9276 3.9527 3.8991 3.6837 3.5215 4.0642 3.9283 3.8863 3.8315 3.5410 1.0028 1.0310 1.0179 0.9988 0.9999 1.0023 1.0023 1.0046 1.0013 1.0305 1.0286 1.0243 0.9963 0.9956 1.0079 1.0018 0.9990 0.9956 0.9911 1.0029 1.0114 0.9888 1.0201 0.9468
dispcorr: -0.023289104 hartree
energy: -964.193235859704
dipole: -21.25894 19.77203 -1.48692 6.22446 -5.89544 0.32903 -14.23424 12.91994 -1.31430
magnitude: 2.01161 au
magnitude: 5.11309 debye
