program: Orca
programVersion: 5.0.2
elementType: O O O C C C C C C C C C C C C C C C C C C C H H H H H H H H H H H H H H H H H H H H H H H H
charge: 0
multiplicity: 1
keywords: wb97x-d3
keywords: def2-TZVPP
keywords: def2/J RIJCOSX
keywords: DEFGRID2
keywords: scfconv7
keywords: smallprint printgap noloewdin
keywords: NOSOSCF
formula: C19H24O3
InChI: InChI=1/C19H24O3/c1-7-8-13-12(4)16(10-15(13)20)22-18(21)17-14(9-11(2)3)19(17,5)6/h1,9,14,16-17H,8,10H2,2-6H3
46 atoms
O  -0.284766 -0.903864 1.23318
O  -1.627906 0.565822 2.257427
O  4.037857 -2.094665 1.452252
C  -3.488161 0.020767 -0.189527
C  -2.424296 -0.711915 -0.978467
C  -2.495429 -0.845503 0.522462
C  -3.41274 1.52261 -0.071626
C  -4.900261 -0.502611 -0.284529
C  -1.295301 -0.015865 -1.651766
C  -1.450543 -0.287117 1.424352
C  -1.39801 0.690414 -2.781117
C  0.858561 -0.544223 2.02162
C  -0.1959 1.326745 -3.408898
C  -2.687049 0.90701 -3.509828
C  1.748831 -1.767241 2.193252
C  1.70099 0.454165 1.2604
C  2.917754 -0.037366 0.986275
C  3.049216 -1.397782 1.520645
C  1.173995 1.792416 0.903025
C  4.022753 0.627642 0.223316
C  3.822049 0.506338 -1.215874
C  3.635015 0.404553 -2.398983
H  -2.784377 -1.592111 -1.506376
H  -2.857579 -1.802068 0.89342
H  -3.921465 1.98655 -0.91918
H  -3.913013 1.86754 0.835208
H  -2.394392 1.907431 -0.057474
H  -5.415589 -0.077355 -1.14877
H  -4.92649 -1.588828 -0.38587
H  -5.47822 -0.240808 0.604692
H  -0.305151 -0.134279 -1.222204
H  0.537153 -0.131601 2.979939
H  1.323543 -2.658972 1.72908
H  1.926349 -2.004531 3.24348
H  -0.317981 2.411141 -3.478188
H  0.717681 1.126874 -2.84738
H  -0.047713 0.967888 -4.431075
H  -2.905625 1.973885 -3.605164
H  -2.621007 0.517443 -4.529551
H  -3.538718 0.430883 -3.026671
H  0.36532 1.715633 0.171354
H  1.940942 2.434728 0.47385
H  0.75918 2.2905 1.781121
H  4.092085 1.684926 0.489697
H  4.982002 0.179365 0.493408
H  3.476527 0.309857 -3.44965
elementType: O C H
totalener: -964.16528623 hartree
nucrepener: 1840.71608511 hartree
electener: -2804.88137134 hartree
oneelecener: -4966.11164296 hartree
twoeener: 2161.23027162 hartree
cpcmener: -0.03233361 hartree
kineticenergy: 959.76156923 hartree
xcener: -94.692244642945 hartree
chargesum: 0.0000000
charge: -0.277370 -0.440080 -0.442613 0.085834 -0.013817 -0.080675 -0.283518 -0.272765 -0.284166 0.363265 -0.012245 0.222714 -0.207103 -0.267189 -0.134253 -0.034810 -0.089075 0.290929 -0.241203 -0.094369 -0.439697 0.019084 0.107950 0.109279 0.094665 0.104360 0.086018 0.089786 0.086865 0.096560 0.119412 0.111894 0.099087 0.103696 0.096251 0.060299 0.098283 0.099416 0.107591 0.089424 0.104193 0.107308 0.124377 0.131158 0.115334 0.289918
qa: -0.2774 -0.4401 -0.4426 0.0858 -0.0138 -0.0807 -0.2835 -0.2728 -0.2842 0.3633 -0.0122 0.2227 -0.2071 -0.2672 -0.1343 -0.0348 -0.0891 0.2909 -0.2412 -0.0944 -0.4397 0.0191 0.1079 0.1093 0.0947 0.1044 0.0860 0.0898 0.0869 0.0966 0.1194 0.1119 0.0991 0.1037 0.0963 0.0603 0.0983 0.0994 0.1076 0.0894 0.1042 0.1073 0.1244 0.1312 0.1153 0.2899
va: 2.1228 2.0537 2.0642 3.7158 3.7845 3.8552 3.9098 3.8995 3.8365 4.1550 3.6947 3.7891 3.9356 3.9347 3.9030 3.6983 3.5167 4.0720 3.9361 3.8773 3.8462 3.5761 1.0048 1.0137 1.0006 1.0089 1.0005 1.0031 1.0046 1.0022 1.0076 1.0261 1.0305 1.0214 0.9984 1.0133 0.9991 0.9961 1.0008 1.0066 0.9930 1.0050 1.0055 0.9915 1.0161 0.9457
dispcorr: -0.025752309 hartree
energy: -964.191038541702
dipole: -20.16008 18.77448 -1.38560 10.93628 -10.03218 0.90409 -15.54955 15.00402 -0.54553
magnitude: 1.74209 au
magnitude: 4.42804 debye
