program: Orca
programVersion: 5.0.2
elementType: O O O C C C C C C C C C C C C C C C C C C C H H H H H H H H H H H H H H H H H H H H H H H H
charge: 0
multiplicity: 1
keywords: wb97x-d3
keywords: def2-TZVPP
keywords: def2/J RIJCOSX
keywords: DEFGRID2
keywords: scfconv7
keywords: smallprint printgap noloewdin
keywords: NOSOSCF
formula: C19H24O3
InChI: InChI=1/C19H24O3/c1-7-8-13-12(4)16(10-15(13)20)22-18(21)17-14(9-11(2)3)19(17,5)6/h1,9,14,16-17H,8,10H2,2-6H3
46 atoms
O  -0.599733 0.069054 1.102338
O  -1.571346 -0.917282 2.847821
O  3.03914 -2.072744 0.113563
C  -3.279219 0.356353 -0.206858
C  -2.800514 -1.006552 -0.589626
C  -2.844853 -0.609795 0.883237
C  -2.489128 1.599164 -0.542785
C  -4.771554 0.592111 -0.257007
C  -1.515514 -1.2911 -1.28232
C  -1.632829 -0.498434 1.714298
C  -1.210195 -0.932996 -2.531414
C  0.678087 0.052255 1.749094
C  0.106171 -1.308469 -3.142611
C  -2.119899 -0.144933 -3.421228
C  1.340111 -1.318854 1.677333
C  1.551457 0.947927 0.903938
C  2.495511 0.25079 0.257273
C  2.389197 -1.173923 0.601065
C  1.299743 2.406834 0.854419
C  3.522985 0.766203 -0.706373
C  4.410976 1.753189 -0.105287
C  5.125306 2.575514 0.402556
H  -3.593661 -1.709515 -0.836746
H  -3.655849 -1.05007 1.451598
H  -1.447392 1.409232 -0.783607
H  -2.938243 2.082775 -1.41243
H  -2.526451 2.320064 0.276588
H  -5.066481 1.385571 0.433042
H  -5.077768 0.895823 -1.260559
H  -5.338145 -0.302593 0.005296
H  -0.794761 -1.897412 -0.74101
H  0.586429 0.432508 2.769108
H  0.653897 -2.138652 1.463155
H  1.840854 -1.559143 2.618391
H  0.650777 -0.419367 -3.472428
H  0.745932 -1.852001 -2.44671
H  -0.031823 -1.93069 -4.030677
H  -1.669664 0.813472 -3.692379
H  -2.288875 -0.678765 -4.360485
H  -3.092944 0.053116 -2.975574
H  1.593984 2.86572 1.802094
H  0.238078 2.620346 0.72267
H  1.850198 2.902246 0.057458
H  4.11719 -0.069125 -1.085028
H  3.033471 1.207635 -1.579366
H  5.76538 3.302614 0.849606
elementType: O C H
totalener: -964.16534558 hartree
nucrepener: 1864.80314158 hartree
electener: -2828.96848717 hartree
oneelecener: -5014.05204560 hartree
twoeener: 2185.08355844 hartree
cpcmener: -0.03238738 hartree
kineticenergy: 959.77038172 hartree
xcener: -94.696190019945 hartree
chargesum: 0.0000000
charge: -0.263618 -0.467870 -0.445343 0.088527 0.004792 -0.092941 -0.297226 -0.271122 -0.278667 0.374743 -0.011160 0.246060 -0.239646 -0.263134 -0.159107 -0.026478 -0.086362 0.290375 -0.258332 -0.118595 -0.465294 0.061588 0.111011 0.091909 0.089867 0.098052 0.118256 0.099091 0.090445 0.087171 0.120816 0.108977 0.102965 0.115130 0.093052 0.086034 0.103690 0.100202 0.107165 0.091343 0.123063 0.109377 0.099166 0.111586 0.132910 0.287532
qa: -0.2636 -0.4679 -0.4453 0.0885 0.0048 -0.0929 -0.2972 -0.2711 -0.2787 0.3747 -0.0112 0.2461 -0.2396 -0.2631 -0.1591 -0.0265 -0.0864 0.2904 -0.2583 -0.1186 -0.4653 0.0616 0.1110 0.0919 0.0899 0.0981 0.1183 0.0991 0.0904 0.0872 0.1208 0.1090 0.1030 0.1151 0.0931 0.0860 0.1037 0.1002 0.1072 0.0913 0.1231 0.1094 0.0992 0.1116 0.1329 0.2875
va: 2.1082 2.0384 2.0504 3.6788 3.7747 3.8719 3.8849 3.9136 3.8794 4.1657 3.6577 3.7512 3.9257 3.9378 3.9054 3.7221 3.5155 4.0196 3.9451 3.9027 3.8553 3.5124 1.0062 1.0260 1.0017 1.0014 0.9992 1.0003 1.0038 1.0061 1.0061 1.0181 1.0266 1.0159 0.9962 1.0116 0.9983 0.9956 1.0007 1.0051 0.9956 1.0059 1.0001 1.0215 0.9884 0.9465
dispcorr: -0.026171553 hartree
energy: -964.191517137637
dipole: -15.44509 14.28843 -1.15666 8.23612 -6.22220 2.01391 -15.44317 14.52600 -0.91717
magnitude: 2.49698 au
magnitude: 6.34682 debye
