program: Orca
programVersion: 5.0.2
elementType: O O O C C C C C C C C C C C C C C C C C C C H H H H H H H H H H H H H H H H H H H H H H H H
charge: 0
multiplicity: 1
keywords: wb97x-d3
keywords: def2-TZVPP
keywords: def2/J RIJCOSX
keywords: DEFGRID2
keywords: scfconv7
keywords: smallprint printgap noloewdin
keywords: NOSOSCF
formula: C19H24O3
InChI: InChI=1/C19H24O3/c1-7-8-13-12(4)16(10-15(13)20)22-18(21)17-14(9-11(2)3)19(17,5)6/h1,9,14,16-17H,8,10H2,2-6H3
46 atoms
O  -0.59632 0.06062 1.090535
O  -1.566587 -0.913772 2.843256
O  3.089122 -2.072561 0.163083
C  -3.283874 0.358957 -0.205036
C  -2.811412 -1.005271 -0.590757
C  -2.845953 -0.608972 0.88225
C  -2.491765 1.599203 -0.545338
C  -4.775693 0.599465 -0.247044
C  -1.531557 -1.292752 -1.291565
C  -1.629906 -0.499995 1.707998
C  -1.235065 -0.937323 -2.543552
C  0.681038 0.049473 1.738021
C  0.076444 -1.315057 -3.163507
C  -2.150551 -0.150239 -3.428216
C  1.346492 -1.320862 1.679173
C  1.55511 0.94138 0.890108
C  2.512694 0.244921 0.2628
C  2.416625 -1.176019 0.623537
C  1.296273 2.398486 0.823317
C  3.548241 0.759141 -0.692581
C  4.415348 1.764156 -0.090823
C  5.110933 2.600482 0.42015
H  -3.608103 -1.705714 -0.833607
H  -3.655253 -1.046691 1.455006
H  -2.525141 2.321555 0.272936
H  -1.45116 1.406393 -0.788717
H  -2.942094 2.082411 -1.414589
H  -5.086262 0.904346 -1.248914
H  -5.343701 -0.293521 0.018006
H  -5.064535 1.393721 0.444655
H  -0.807254 -1.898079 -0.754006
H  0.587613 0.436866 2.755301
H  0.664448 -2.139992 1.448895
H  1.827179 -1.563712 2.629836
H  0.619268 -0.427179 -3.499344
H  0.720552 -1.857337 -2.47094
H  -0.068169 -1.939451 -4.048897
H  -1.701907 0.807656 -3.703707
H  -2.325957 -0.685321 -4.365574
H  -3.12051 0.048673 -2.976262
H  0.23182 2.607569 0.709819
H  1.829814 2.883366 0.008464
H  1.608989 2.872247 1.757797
H  4.157611 -0.073986 -1.05142
H  3.066468 1.183355 -1.578344
H  5.734125 3.34045 0.8698
elementType: O C H
totalener: -964.16550429 hartree
nucrepener: 1862.64087979 hartree
electener: -2826.80638408 hartree
oneelecener: -5009.71432457 hartree
twoeener: 2182.90794049 hartree
cpcmener: -0.03243943 hartree
kineticenergy: 959.77079562 hartree
xcener: -94.696293498267 hartree
chargesum: 0.0000000
charge: -0.263673 -0.468050 -0.445604 0.088709 0.004839 -0.093363 -0.297714 -0.270945 -0.278170 0.375900 -0.011495 0.244720 -0.238964 -0.262983 -0.159985 -0.024796 -0.088827 0.293032 -0.261713 -0.116385 -0.464011 0.058781 0.111106 0.092043 0.118347 0.090059 0.098035 0.090407 0.087148 0.099052 0.120172 0.109056 0.103341 0.115083 0.092986 0.086490 0.103071 0.100173 0.107066 0.091412 0.109333 0.100303 0.123889 0.111418 0.133196 0.287510
qa: -0.2637 -0.4681 -0.4456 0.0887 0.0048 -0.0934 -0.2977 -0.2709 -0.2782 0.3759 -0.0115 0.2447 -0.2390 -0.2630 -0.1600 -0.0248 -0.0888 0.2930 -0.2617 -0.1164 -0.4640 0.0588 0.1111 0.0920 0.1183 0.0901 0.0980 0.0904 0.0871 0.0991 0.1202 0.1091 0.1033 0.1151 0.0930 0.0865 0.1031 0.1002 0.1071 0.0914 0.1093 0.1003 0.1239 0.1114 0.1332 0.2875
va: 2.1080 2.0385 2.0522 3.6792 3.7743 3.8732 3.8854 3.9136 3.8800 4.1637 3.6589 3.7530 3.9258 3.9378 3.9047 3.7189 3.5186 4.0219 3.9451 3.9010 3.8504 3.5153 1.0062 1.0261 0.9991 1.0016 1.0014 1.0039 1.0061 1.0003 1.0065 1.0181 1.0261 1.0161 0.9963 1.0108 0.9982 0.9956 1.0008 1.0051 1.0065 0.9993 0.9953 1.0216 0.9883 0.9465
dispcorr: -0.026054039 hartree
energy: -964.191558327256
dipole: -15.64475 14.45102 -1.19373 8.22469 -6.21626 2.00843 -15.57370 14.61685 -0.95685
magnitude: 2.52475 au
magnitude: 6.41740 debye
