program: Orca
programVersion: 5.0.2
elementType: O O O C C C C C C C C C C C C C C C C C C C H H H H H H H H H H H H H H H H H H H H H H H H
charge: 0
multiplicity: 1
keywords: wb97x-d3
keywords: def2-TZVPP
keywords: def2/J RIJCOSX
keywords: DEFGRID2
keywords: scfconv7
keywords: smallprint printgap noloewdin
keywords: NOSOSCF
formula: C19H24O3
InChI: InChI=1/C19H24O3/c1-7-8-13-12(4)16(10-15(13)20)22-18(21)17-14(9-11(2)3)19(17,5)6/h1,9,14,16-17H,8,10H2,2-6H3
46 atoms
O  -0.625028 -0.045047 1.05787
O  -1.817072 -1.580547 2.144392
O  3.20805 -2.0192 -0.00602
C  -3.204729 0.993725 -0.141676
C  -2.671007 -0.031502 -1.082303
C  -2.860422 -0.383546 0.398584
C  -2.398805 2.218353 0.219651
C  -4.687863 1.279879 -0.203333
C  -1.338943 0.087543 -1.728429
C  -1.739606 -0.728186 1.287569
C  -0.629762 -0.931207 -2.220346
C  0.555095 -0.407049 1.781018
C  0.680415 -0.70472 -2.910773
C  -1.064571 -2.360909 -2.122468
C  1.175087 -1.71005 1.286975
C  1.563186 0.659388 1.440588
C  2.608645 0.158704 0.76897
C  2.444667 -1.286632 0.585417
C  1.350982 2.078866 1.822826
C  3.783555 0.917431 0.231622
C  3.426204 1.706967 -0.941411
C  3.10444 2.355466 -1.900992
H  -3.421154 -0.519135 -1.699747
H  -3.718652 -1.011544 0.608162
H  -2.606705 2.528171 1.245763
H  -1.324354 2.095336 0.120561
H  -2.689455 3.04439 -0.432844
H  -5.054393 1.660853 0.75212
H  -4.900643 2.033555 -0.964349
H  -5.267237 0.38901 -0.449938
H  -0.935314 1.089789 -1.838692
H  0.344955 -0.418614 2.853833
H  0.530535 -2.272419 0.609287
H  1.424976 -2.376791 2.114819
H  0.93464 0.353463 -2.976382
H  1.49481 -1.213458 -2.387641
H  0.667091 -1.11142 -3.925797
H  -1.925298 -2.505322 -1.470794
H  -1.324054 -2.757431 -3.108555
H  -0.251433 -2.987789 -1.747033
H  0.367696 2.246962 2.258421
H  1.463818 2.742861 0.964233
H  2.096476 2.387123 2.560262
H  4.186607 1.583253 0.999749
H  4.586868 0.223668 -0.02787
H  2.824122 2.931415 -2.754312
elementType: O C H
totalener: -964.16629378 hartree
nucrepener: 1897.20206953 hartree
electener: -2861.36836331 hartree
oneelecener: -5079.33347709 hartree
twoeener: 2217.96511378 hartree
cpcmener: -0.03292264 hartree
kineticenergy: 959.77309269 hartree
xcener: -94.696275148751 hartree
chargesum: 0.0000000
charge: -0.259164 -0.470812 -0.447954 0.150606 -0.028210 -0.135964 -0.290589 -0.269273 -0.230506 0.392567 -0.038557 0.231664 -0.234102 -0.278255 -0.140222 -0.026394 -0.087490 0.272007 -0.291137 -0.063901 -0.446252 0.002107 0.112818 0.092999 0.106695 0.076341 0.100252 0.095748 0.093739 0.086409 0.120835 0.113332 0.104038 0.116184 0.082815 0.089165 0.108219 0.095741 0.114083 0.093022 0.105821 0.117281 0.133325 0.130160 0.113911 0.286900
qa: -0.2592 -0.4708 -0.4480 0.1506 -0.0282 -0.1360 -0.2906 -0.2693 -0.2305 0.3926 -0.0386 0.2317 -0.2341 -0.2783 -0.1402 -0.0264 -0.0875 0.2720 -0.2911 -0.0639 -0.4463 0.0021 0.1128 0.0930 0.1067 0.0763 0.1003 0.0957 0.0937 0.0864 0.1208 0.1133 0.1040 0.1162 0.0828 0.0892 0.1082 0.0957 0.1141 0.0930 0.1058 0.1173 0.1333 0.1302 0.1139 0.2869
va: 2.1049 2.0362 2.0438 3.7166 3.8013 3.8711 3.9101 3.9059 3.8158 4.1377 3.6927 3.7502 3.9187 3.9423 3.8880 3.7491 3.5106 4.0182 3.9407 3.8538 3.8256 3.5928 1.0036 1.0275 0.9992 1.0041 1.0012 1.0015 1.0021 1.0055 0.9994 1.0157 1.0209 1.0177 1.0089 1.0042 0.9999 1.0041 0.9989 0.9988 1.0085 0.9932 0.9962 0.9917 1.0185 0.9483
dispcorr: -0.027506546 hartree
energy: -964.193800324654
dipole: -11.77367 10.99779 -0.77588 7.81326 -5.76790 2.04536 -8.20122 8.50482 0.30360
magnitude: 2.20854 au
magnitude: 5.61366 debye
