program: Orca
programVersion: 5.0.2
elementType: O O O C C C C C C C C C C C C C C C C C C C H H H H H H H H H H H H H H H H H H H H H H H H
charge: 0
multiplicity: 1
keywords: wb97x-d3
keywords: def2-TZVPP
keywords: def2/J RIJCOSX
keywords: DEFGRID2
keywords: scfconv7
keywords: smallprint printgap noloewdin
keywords: NOSOSCF
formula: C19H24O3
InChI: InChI=1/C19H24O3/c1-7-8-13-12(4)16(10-15(13)20)22-18(21)17-14(9-11(2)3)19(17,5)6/h1,9,14,16-17H,8,10H2,2-6H3
46 atoms
O  -0.500637 -0.317101 0.949353
O  -1.619449 -1.359446 2.572036
O  3.781547 -1.892045 1.838406
C  -3.353631 0.233828 -0.126865
C  -2.651361 -0.769004 -0.989769
C  -2.718909 -0.991715 0.509243
C  -2.765147 1.604309 0.102476
C  -4.864359 0.238292 -0.146918
C  -1.383517 -0.51327 -1.72367
C  -1.5821 -0.916244 1.455616
C  -1.232427 0.347372 -2.731066
C  0.643261 -0.177375 1.784899
C  0.088175 0.490416 -3.427879
C  -2.328171 1.221351 -3.260901
C  1.393693 -1.47569 2.068778
C  1.622343 0.680986 1.02559
C  2.836291 0.122991 0.974189
C  2.824438 -1.185838 1.652812
C  1.197076 1.974891 0.435406
C  4.07674 0.670297 0.334376
C  3.919939 0.870409 -1.100491
C  3.771917 1.039401 -2.279447
H  -3.321517 -1.442274 -1.52178
H  -3.428015 -1.740951 0.841925
H  -3.212131 2.318157 -0.591303
H  -2.98634 1.952761 1.11328
H  -1.690388 1.639478 -0.045222
H  -5.274444 -0.76076 -0.298927
H  -5.268112 0.622974 0.79109
H  -5.2369 0.873701 -0.953436
H  -0.530412 -1.122813 -1.450024
H  0.349192 0.318565 2.716663
H  1.011404 -2.299557 1.461905
H  1.334249 -1.79412 3.108401
H  0.007981 0.221021 -4.484147
H  0.436572 1.526317 -3.396547
H  0.859975 -0.131617 -2.97591
H  -3.287629 1.040341 -2.780849
H  -2.08175 2.2789 -3.13712
H  -2.458525 1.059201 -4.33384
H  2.043217 2.612793 0.188214
H  0.533635 2.518847 1.109672
H  0.641264 1.794352 -0.488122
H  4.360239 1.617553 0.803129
H  4.902589 -0.021152 0.519063
H  3.647461 1.179649 -3.325959
totalener: -964.14187943 hartree
nucrepener: 1858.04733742 hartree
electener: -2822.18921685 hartree
oneelecener: -5000.43344667 hartree
twoeener: 2178.24422982 hartree
kineticenergy: 959.83157586 hartree
xcener: -94.700847889950 hartree
chargesum: -0.0000000
charge: -0.270609 -0.354702 -0.328057 0.043662 0.013132 -0.067513 -0.262736 -0.246100 -0.193940 0.306263 -0.033730 0.180740 -0.228852 -0.250045 -0.136360 0.000482 -0.059893 0.228385 -0.301643 -0.153793 -0.391615 0.064018 0.102421 0.088465 0.086769 0.111657 0.078943 0.075261 0.096517 0.081653 0.084027 0.094845 0.087594 0.102282 0.100155 0.080241 0.086169 0.083760 0.091052 0.098061 0.109370 0.108875 0.110184 0.118623 0.120322 0.245660
qa: -0.2706 -0.3547 -0.3281 0.0437 0.0131 -0.0675 -0.2627 -0.2461 -0.1939 0.3063 -0.0337 0.1807 -0.2289 -0.2500 -0.1364 0.0005 -0.0599 0.2284 -0.3016 -0.1538 -0.3916 0.0640 0.1024 0.0885 0.0868 0.1117 0.0789 0.0753 0.0965 0.0817 0.0840 0.0948 0.0876 0.1023 0.1002 0.0802 0.0862 0.0838 0.0911 0.0981 0.1094 0.1089 0.1102 0.1186 0.1203 0.2457
va: 2.0856 2.1564 2.1754 3.7563 3.7493 3.8589 3.9005 3.9198 3.8732 4.2418 3.7367 3.8174 3.9345 3.9383 3.8824 3.6193 3.4900 4.0936 3.9815 3.9146 3.8602 3.6124 1.0069 1.0281 1.0052 1.0036 1.0048 1.0092 1.0030 1.0056 1.0306 1.0161 1.0267 1.0284 1.0008 0.9961 1.0073 1.0090 0.9975 1.0047 1.0048 1.0027 0.9850 0.9864 1.0197 0.9731
dispcorr: -0.026604268 hartree
energy: -964.168483697153
dipole: -17.59929 16.52356 -1.07573 13.40917 -11.93358 1.47559 -16.22445 15.21276 -1.01170
magnitude: 2.08760 au
magnitude: 5.30627 debye
