program: Orca
programVersion: 5.0.2
elementType: O O O C C C C C C C C C C C C C C C C C C C H H H H H H H H H H H H H H H H H H H H H H H H
charge: 0
multiplicity: 1
keywords: wb97x-d3
keywords: def2-TZVPP
keywords: def2/J RIJCOSX
keywords: DEFGRID2
keywords: scfconv7
keywords: smallprint printgap noloewdin
keywords: NOSOSCF
formula: C19H24O3
InChI: InChI=1/C19H24O3/c1-7-8-13-12(4)16(10-15(13)20)22-18(21)17-14(9-11(2)3)19(17,5)6/h1,9,14,16-17H,8,10H2,2-6H3
46 atoms
O  -0.247364 -0.51431 1.201405
O  -1.257312 1.355469 0.486532
O  3.895265 -1.089247 3.103703
C  -3.837584 -0.353734 0.348352
C  -3.154108 -0.563101 -0.959432
C  -2.378365 -0.758368 0.349772
C  -4.274504 1.020921 0.791989
C  -4.7911 -1.437917 0.79735
C  -2.844741 0.539848 -1.897181
C  -1.27782 0.168393 0.674815
C  -2.108614 0.418943 -3.003127
C  0.943078 0.193002 1.542696
C  -1.897423 1.582669 -3.923217
C  -1.427821 -0.84996 -3.419296
C  1.581559 -0.422125 2.781073
C  1.980189 0.045932 0.453046
C  3.141874 -0.411625 0.937394
C  3.017273 -0.697899 2.378486
C  1.658031 0.422843 -0.946433
C  4.433532 -0.649309 0.211804
C  4.93997 0.530115 -0.477669
C  5.352586 1.500053 -1.051092
H  -3.380734 -1.509033 -1.442327
H  -2.177788 -1.787852 0.622914
H  -5.262866 1.238228 0.382879
H  -4.355623 1.056127 1.879664
H  -3.600098 1.816239 0.49176
H  -5.789281 -1.259874 0.393579
H  -4.473646 -2.427576 0.465993
H  -4.870976 -1.462348 1.885447
H  -3.272587 1.510747 -1.676663
H  0.711739 1.251591 1.686993
H  1.095314 -1.362285 3.048821
H  1.542099 0.223488 3.658629
H  -0.835005 1.822799 -4.014133
H  -2.253234 1.357912 -4.931965
H  -2.413601 2.476761 -3.57663
H  -0.359528 -0.676962 -3.574327
H  -1.526246 -1.651267 -2.689527
H  -1.819991 -1.21253 -4.37288
H  0.878129 -0.228637 -1.3478
H  2.524908 0.361729 -1.599702
H  1.262388 1.438637 -0.989812
H  5.17873 -0.98996 0.935329
H  4.316183 -1.464977 -0.508153
H  5.726971 2.361238 -1.549374
totalener: -964.14670539 hartree
nucrepener: 1794.31618486 hartree
electener: -2758.46289025 hartree
oneelecener: -4873.26316315 hartree
twoeener: 2114.80027290 hartree
kineticenergy: 959.81960785 hartree
xcener: -94.699127374076 hartree
chargesum: -0.0000000
charge: -0.279764 -0.384284 -0.331235 0.128592 -0.063903 -0.068160 -0.281337 -0.237933 -0.124146 0.308829 -0.050287 0.217868 -0.208148 -0.274342 -0.141772 -0.044139 -0.066822 0.224707 -0.239012 -0.153485 -0.423526 0.101513 0.091012 0.080505 0.092808 0.087307 0.102092 0.090207 0.070754 0.091328 0.087631 0.102100 0.091143 0.087859 0.082147 0.085384 0.080800 0.080506 0.086083 0.104976 0.096305 0.099995 0.116808 0.118493 0.119407 0.245135
qa: -0.2798 -0.3843 -0.3312 0.1286 -0.0639 -0.0682 -0.2813 -0.2379 -0.1241 0.3088 -0.0503 0.2179 -0.2081 -0.2743 -0.1418 -0.0441 -0.0668 0.2247 -0.2390 -0.1535 -0.4235 0.1015 0.0910 0.0805 0.0928 0.0873 0.1021 0.0902 0.0708 0.0913 0.0876 0.1021 0.0911 0.0879 0.0821 0.0854 0.0808 0.0805 0.0861 0.1050 0.0963 0.1000 0.1168 0.1185 0.1194 0.2451
va: 2.1138 2.0962 2.1723 3.7731 3.8581 3.8514 3.9122 3.8964 3.8633 4.1761 3.7544 3.7824 3.9440 3.9473 3.8787 3.7079 3.4997 4.1095 3.9454 3.8998 3.8733 3.5609 1.0028 1.0322 0.9985 1.0036 1.0220 1.0044 1.0072 1.0051 1.0149 1.0284 1.0315 1.0282 0.9992 0.9976 1.0119 0.9980 1.0058 1.0012 1.0018 1.0108 1.0070 1.0196 0.9853 0.9729
dispcorr: -0.022865634 hartree
energy: -964.169571024427
dipole: -21.95590 20.71569 -1.24022 0.80391 -1.05773 -0.25382 -16.21583 15.20315 -1.01268
magnitude: 1.62113 au
magnitude: 4.12060 debye
