program: Orca
programVersion: 5.0.2
elementType: O O O C C C C C C C C C C C C C C C C C C C H H H H H H H H H H H H H H H H H H H H H H H H
charge: 0
multiplicity: 1
keywords: wb97x-d3
keywords: def2-TZVPP
keywords: def2/J RIJCOSX
keywords: DEFGRID2
keywords: scfconv7
keywords: smallprint printgap noloewdin
keywords: NOSOSCF
formula: C19H24O3
InChI: InChI=1/C19H24O3/c1-7-8-13-12(4)16(10-15(13)20)22-18(21)17-14(9-11(2)3)19(17,5)6/h1,9,14,16-17H,8,10H2,2-6H3
46 atoms
O  0.261762 -0.661881 0.696133
O  -1.245269 0.992231 0.784672
O  4.119153 -1.034939 3.240866
C  -3.188625 -1.283876 -0.171551
C  -2.783354 -0.560521 -1.418538
C  -1.715298 -1.02465 -0.434548
C  -3.926145 -0.553145 0.922806
C  -3.62341 -2.723283 -0.314182
C  -3.103407 0.860502 -1.659871
C  -0.920283 -0.100027 0.397633
C  -3.73718 1.343914 -2.731634
C  1.1635 0.037272 1.550878
C  -4.016715 2.81329 -2.849444
C  -4.236787 0.526718 -3.884883
C  1.786002 -0.910127 2.567886
C  2.328749 0.579188 0.76103
C  3.499281 0.22626 1.305673
C  3.275069 -0.63116 2.483577
C  2.100207 1.420602 -0.439937
C  4.879318 0.60291 0.856251
C  5.206767 0.059059 -0.455402
C  5.457763 -0.387947 -1.540255
H  -2.791605 -1.178926 -2.309728
H  -1.152088 -1.894054 -0.752883
H  -3.7709 -1.046943 1.883725
H  -3.632484 0.486038 1.033142
H  -4.996411 -0.573101 0.71118
H  -3.090998 -3.235327 -1.116859
H  -3.446635 -3.27914 0.608449
H  -4.690504 -2.780078 -0.536741
H  -2.808265 1.566359 -0.894821
H  0.637933 0.862748 2.038123
H  1.606316 -1.950584 2.288443
H  1.413377 -0.775097 3.583114
H  -3.556125 3.231581 -3.748199
H  -5.089732 3.004519 -2.932933
H  -3.643517 3.371368 -1.991858
H  -4.005176 -0.533211 -3.808357
H  -5.322616 0.615427 -3.973153
H  -3.819979 0.891025 -4.826999
H  1.709371 0.813435 -1.259235
H  3.014944 1.891666 -0.793469
H  1.357907 2.194736 -0.238365
H  4.987616 1.691336 0.832898
H  5.600642 0.239188 1.592195
H  5.68868 -0.787689 -2.497681
totalener: -964.14760080 hartree
nucrepener: 1750.98149566 hartree
electener: -2715.12909645 hartree
oneelecener: -4786.58026210 hartree
twoeener: 2071.45116565 hartree
kineticenergy: 959.82226338 hartree
xcener: -94.699797801965 hartree
chargesum: 0.0000000
charge: -0.280572 -0.403252 -0.328885 0.096938 0.024190 -0.114537 -0.258155 -0.238537 -0.231474 0.353996 -0.039127 0.216654 -0.207159 -0.240135 -0.133961 -0.041909 -0.058363 0.219909 -0.243691 -0.158725 -0.415133 0.092470 0.088899 0.083790 0.088459 0.102228 0.088850 0.071195 0.089127 0.089697 0.116852 0.098605 0.089722 0.088142 0.082318 0.082262 0.081455 0.076223 0.087426 0.086436 0.106463 0.094161 0.115958 0.118237 0.118221 0.244733
qa: -0.2806 -0.4033 -0.3289 0.0969 0.0242 -0.1145 -0.2582 -0.2385 -0.2315 0.3540 -0.0391 0.2167 -0.2072 -0.2401 -0.1340 -0.0419 -0.0584 0.2199 -0.2437 -0.1587 -0.4151 0.0925 0.0889 0.0838 0.0885 0.1022 0.0889 0.0712 0.0891 0.0897 0.1169 0.0986 0.0897 0.0881 0.0823 0.0823 0.0815 0.0762 0.0874 0.0864 0.1065 0.0942 0.1160 0.1182 0.1182 0.2447
va: 2.1218 2.0835 2.1735 3.7399 3.7904 3.9221 3.9258 3.9092 3.8933 4.1558 3.7910 3.7804 3.9406 3.9466 3.8751 3.7077 3.4876 4.1108 3.9474 3.9167 3.8610 3.5745 1.0102 1.0319 1.0019 1.0177 1.0034 1.0084 1.0050 1.0038 1.0257 1.0333 1.0310 1.0284 0.9982 0.9984 1.0122 1.0158 0.9994 0.9993 1.0027 1.0048 1.0079 0.9853 1.0198 0.9732
dispcorr: -0.021068559 hartree
energy: -964.168669354296
dipole: -28.02093 26.85710 -1.16383 3.00682 -2.92708 0.07974 -15.80104 14.70154 -1.09949
magnitude: 1.60304 au
magnitude: 4.07461 debye
