program: Orca
programVersion: 5.0.2
elementType: O O O C C C C C C C C C C C C C C C C C C C H H H H H H H H H H H H H H H H H H H H H H H H
charge: 0
multiplicity: 1
keywords: wb97x-d3
keywords: def2-TZVPP
keywords: def2/J RIJCOSX
keywords: DEFGRID2
keywords: scfconv7
keywords: smallprint printgap noloewdin
keywords: NOSOSCF
formula: C19H24O3
InChI: InChI=1/C19H24O3/c1-7-8-13-12(4)16(10-15(13)20)22-18(21)17-14(9-11(2)3)19(17,5)6/h1,9,14,16-17H,8,10H2,2-6H3
46 atoms
O  -0.154677 -0.746391 0.983702
O  -1.401925 1.117761 0.954516
O  4.011977 -1.406072 2.864797
C  -3.728858 -0.734906 0.084554
C  -3.046241 -0.331054 -1.176486
C  -2.227336 -0.910501 -0.017137
C  -4.339079 0.294747 1.003691
C  -4.51488 -2.025996 0.054613
C  -2.909406 1.080276 -1.606216
C  -1.263101 -0.046261 0.687958
C  -2.097186 1.503215 -2.575661
C  0.917614 -0.086555 1.651968
C  -2.062356 2.942508 -2.989878
C  -1.161293 0.603254 -3.324135
C  1.620099 -1.049048 2.60141
C  1.984292 0.339858 0.67145
C  3.194188 -0.10009 1.037981
C  3.092467 -0.922463 2.2562
C  1.644095 1.169084 -0.511428
C  4.513999 0.156156 0.373383
C  4.586615 -0.390978 -0.975099
C  4.63681 -0.837815 -2.087574
H  -3.146823 -1.038157 -1.995055
H  -1.88408 -1.929586 -0.151819
H  -5.3571 0.515572 0.677158
H  -4.400239 -0.097419 2.020226
H  -3.7864 1.227772 1.047316
H  -4.07579 -2.759341 -0.623064
H  -4.561335 -2.477713 1.04695
H  -5.538573 -1.843278 -0.276788
H  -3.537619 1.81126 -1.109989
H  0.534353 0.792683 2.176967
H  1.2999 -2.077275 2.420878
H  1.443232 -0.833863 3.655213
H  -2.291544 3.052939 -4.052884
H  -2.773555 3.547023 -2.428937
H  -1.067468 3.369282 -2.839463
H  -0.147073 1.010359 -3.313574
H  -1.115408 -0.40458 -2.915296
H  -1.448587 0.52679 -4.376189
H  1.068987 0.581133 -1.230356
H  2.530708 1.533078 -1.026098
H  1.018909 2.017017 -0.22908
H  4.715774 1.23091 0.336852
H  5.305715 -0.282288 0.985995
H  4.685801 -1.244788 -3.068265
totalener: -964.14633838 hartree
nucrepener: 1802.34455685 hartree
electener: -2766.49089523 hartree
oneelecener: -4889.33971673 hartree
twoeener: 2122.84882150 hartree
kineticenergy: 959.82511470 hartree
xcener: -94.699637504101 hartree
chargesum: -0.0000000
charge: -0.278402 -0.385727 -0.330252 0.130245 -0.061172 -0.083925 -0.283042 -0.239420 -0.137335 0.319249 -0.024633 0.212144 -0.207192 -0.290170 -0.132126 -0.027016 -0.061692 0.218415 -0.265177 -0.162029 -0.414129 0.091615 0.094190 0.082777 0.092372 0.087326 0.102500 0.071743 0.091638 0.089174 0.085082 0.097707 0.091017 0.087312 0.085231 0.080083 0.082184 0.081314 0.089597 0.107310 0.107169 0.099027 0.123402 0.119289 0.119709 0.244620
qa: -0.2784 -0.3857 -0.3303 0.1302 -0.0612 -0.0839 -0.2830 -0.2394 -0.1373 0.3192 -0.0246 0.2121 -0.2072 -0.2902 -0.1321 -0.0270 -0.0617 0.2184 -0.2652 -0.1620 -0.4141 0.0916 0.0942 0.0828 0.0924 0.0873 0.1025 0.0717 0.0916 0.0892 0.0851 0.0977 0.0910 0.0873 0.0852 0.0801 0.0822 0.0813 0.0896 0.1073 0.1072 0.0990 0.1234 0.1193 0.1197 0.2446
va: 2.1176 2.0954 2.1730 3.7635 3.8650 3.8428 3.9123 3.8978 3.8719 4.1700 3.7312 3.8105 3.9434 3.9523 3.8726 3.6829 3.4906 4.1131 3.9533 3.9152 3.8663 3.5754 1.0026 1.0319 0.9981 1.0041 1.0210 1.0072 1.0049 1.0048 1.0138 1.0294 1.0315 1.0281 0.9974 1.0118 0.9992 0.9986 1.0037 1.0015 0.9975 1.0054 1.0080 0.9851 1.0195 0.9735
dispcorr: -0.023156654 hartree
energy: -964.169495035210
dipole: -21.29797 20.13899 -1.15899 6.00960 -5.77345 0.23615 -14.50314 13.55946 -0.94369
magnitude: 1.51313 au
magnitude: 3.84607 debye
