program: Orca
programVersion: 5.0.2
elementType: O O O C C C C C C C C C C C C C C C C C C C H H H H H H H H H H H H H H H H H H H H H H H H
charge: 0
multiplicity: 1
keywords: wb97x-d3
keywords: def2-TZVPP
keywords: def2/J RIJCOSX
keywords: DEFGRID2
keywords: scfconv7
keywords: smallprint printgap noloewdin
keywords: NOSOSCF
formula: C19H24O3
InChI: InChI=1/C19H24O3/c1-7-8-13-12(4)16(10-15(13)20)22-18(21)17-14(9-11(2)3)19(17,5)6/h1,9,14,16-17H,8,10H2,2-6H3
46 atoms
O  -0.077569 -0.514939 1.20569
O  -1.100488 1.315528 0.419985
O  3.97965 -0.909906 3.341046
C  -3.625266 -0.492143 0.223079
C  -2.917453 -0.750691 -1.070487
C  -2.151622 -0.840155 0.252214
C  -4.118977 0.891961 0.564462
C  -4.543302 -1.580744 0.728813
C  -2.652952 0.299634 -2.071442
C  -1.095555 0.127158 0.612411
C  -2.890234 0.210073 -3.383402
C  1.064404 0.235331 1.616748
C  -2.567923 1.358723 -4.292917
C  -3.484223 -0.976345 -4.080794
C  1.656419 -0.367208 2.883362
C  2.167222 0.145989 0.587052
C  3.320887 -0.254486 1.137018
C  3.126752 -0.559784 2.566405
C  1.912761 0.522998 -0.826177
C  4.664112 -0.415405 0.487476
C  5.148644 0.798756 -0.156088
C  5.542781 1.796715 -0.693318
H  -3.100338 -1.734442 -1.488501
H  -1.922659 -1.850894 0.568871
H  -5.120463 1.026942 0.152494
H  -4.187846 1.015295 1.646556
H  -3.492546 1.690877 0.182244
H  -5.540843 -1.470372 0.300092
H  -4.180784 -2.576757 0.470188
H  -4.640738 -1.535755 1.815007
H  -2.232213 1.227514 -1.705044
H  0.783029 1.282162 1.758516
H  1.20634 -1.336965 3.104816
H  1.527844 0.258695 3.766586
H  -3.461021 1.712053 -4.814679
H  -2.139937 2.20221 -3.75278
H  -1.855282 1.059118 -5.065862
H  -2.81488 -1.338729 -4.8653
H  -3.70513 -1.812781 -3.421614
H  -4.417792 -0.697715 -4.576149
H  1.502153 1.532159 -0.885058
H  1.17119 -0.140912 -1.275777
H  2.815264 0.484647 -1.431064
H  5.381895 -0.729243 1.249756
H  4.631056 -1.224156 -0.248923
H  5.898776 2.683053 -1.159833
totalener: -964.14806649 hartree
nucrepener: 1760.07475931 hartree
electener: -2724.22282580 hartree
oneelecener: -4804.75385613 hartree
twoeener: 2080.53103033 hartree
kineticenergy: 959.81069036 hartree
xcener: -94.698430013891 hartree
chargesum: 0.0000000
charge: -0.278637 -0.397311 -0.331115 0.096536 0.035386 -0.095721 -0.254256 -0.239251 -0.245780 0.328363 -0.040413 0.223156 -0.205068 -0.240906 -0.140403 -0.056693 -0.062146 0.222804 -0.230184 -0.154761 -0.424610 0.102634 0.088808 0.083086 0.086177 0.087282 0.103972 0.089839 0.070782 0.089536 0.113923 0.101304 0.091136 0.087740 0.083253 0.081096 0.082129 0.086695 0.077071 0.088291 0.114254 0.101651 0.096714 0.118678 0.119927 0.245035
qa: -0.2786 -0.3973 -0.3311 0.0965 0.0354 -0.0957 -0.2543 -0.2393 -0.2458 0.3284 -0.0404 0.2232 -0.2051 -0.2409 -0.1404 -0.0567 -0.0621 0.2228 -0.2302 -0.1548 -0.4246 0.1026 0.0888 0.0831 0.0862 0.0873 0.1040 0.0898 0.0708 0.0895 0.1139 0.1013 0.0911 0.0877 0.0833 0.0811 0.0821 0.0867 0.0771 0.0883 0.1143 0.1017 0.0967 0.1187 0.1199 0.2450
va: 2.1221 2.0848 2.1718 3.7371 3.7894 3.9029 3.9218 3.9085 3.8919 4.1694 3.7967 3.7651 3.9397 3.9471 3.8790 3.7274 3.4960 4.1083 3.9427 3.9005 3.8703 3.5607 1.0092 1.0307 1.0026 1.0024 1.0182 1.0041 1.0082 1.0050 1.0242 1.0277 1.0315 1.0284 0.9985 1.0122 0.9983 0.9994 1.0162 0.9994 1.0074 1.0050 1.0096 1.0195 0.9851 0.9730
dispcorr: -0.021361780 hartree
energy: -964.169428273507
dipole: -26.08135 24.78341 -1.29794 -0.24223 -0.08759 -0.32981 -18.42980 17.36190 -1.06790
magnitude: 1.71284 au
magnitude: 4.35369 debye
