program: Orca
programVersion: 5.0.2
elementType: O O O C C C C C C C C C C C C C C C C C C C H H H H H H H H H H H H H H H H H H H H H H H H
charge: 0
multiplicity: 1
keywords: wb97x-d3
keywords: def2-TZVPP
keywords: def2/J RIJCOSX
keywords: DEFGRID2
keywords: scfconv7
keywords: smallprint printgap noloewdin
keywords: NOSOSCF
formula: C19H24O3
InChI: InChI=1/C19H24O3/c1-7-8-13-12(4)16(10-15(13)20)22-18(21)17-14(9-11(2)3)19(17,5)6/h1,9,14,16-17H,8,10H2,2-6H3
46 atoms
O  -0.419657 -0.352852 0.559777
O  -1.53467 -0.604368 2.48531
O  3.91575 -1.242862 -0.605332
C  -2.824536 1.208114 -0.435661
C  -2.945311 -0.196847 -0.922014
C  -2.732987 0.072644 0.568032
C  -1.628489 2.059918 -0.78797
C  -4.09968 2.017743 -0.354912
C  -1.932467 -0.844626 -1.790352
C  -1.521317 -0.32461 1.315238
C  -1.859186 -2.15481 -2.026866
C  0.821445 -0.757278 1.13039
C  -0.843603 -2.719284 -2.973354
C  -2.760169 -3.161551 -1.378988
C  1.617259 -1.573152 0.118194
C  1.677257 0.45236 1.417535
C  2.865238 0.375113 0.806267
C  2.953632 -0.863209 0.011451
C  1.175853 1.541666 2.292632
C  3.995309 1.359282 0.856279
C  3.62608 2.663364 0.321172
C  3.305902 3.735188 -0.11344
H  -3.963852 -0.513058 -1.131298
H  -3.61153 -0.049877 1.190811
H  -1.471237 2.825614 -0.025656
H  -0.70054 1.507288 -0.894822
H  -1.815364 2.577333 -1.730843
H  -4.962136 1.399162 -0.103914
H  -4.020701 2.798772 0.403293
H  -4.307698 2.500735 -1.31148
H  -1.228872 -0.192617 -2.297305
H  0.635563 -1.312245 2.053584
H  1.12374 -1.577358 -0.856049
H  1.755607 -2.613813 0.41298
H  -1.324545 -3.274406 -3.782763
H  -0.224963 -1.943826 -3.424022
H  -0.182157 -3.426139 -2.465358
H  -3.404065 -3.64431 -2.11911
H  -2.174183 -3.957736 -0.913691
H  -3.396948 -2.730413 -0.608684
H  0.423993 2.133419 1.764799
H  1.966891 2.224712 2.595292
H  0.692516 1.136416 3.182379
H  4.348397 1.478417 1.885166
H  4.83786 0.956515 0.28862
H  3.031785 4.683097 -0.508562
totalener: -964.14284509 hartree
nucrepener: 1848.49856169 hartree
electener: -2812.64140678 hartree
oneelecener: -4981.46493521 hartree
twoeener: 2168.82352843 hartree
kineticenergy: 959.82707289 hartree
xcener: -94.700315357902 hartree
chargesum: 0.0000000
charge: -0.254633 -0.367314 -0.330411 0.141111 -0.048364 -0.122000 -0.311090 -0.243172 -0.169698 0.341029 -0.032963 0.158756 -0.236399 -0.251472 -0.114491 -0.029499 -0.062402 0.220193 -0.243456 -0.157834 -0.411545 0.085765 0.096096 0.087976 0.091613 0.092570 0.100739 0.073327 0.092140 0.088368 0.094398 0.105089 0.081137 0.092215 0.099163 0.087391 0.086158 0.096964 0.085626 0.084779 0.103728 0.096372 0.121036 0.119142 0.119146 0.244717
qa: -0.2546 -0.3673 -0.3304 0.1411 -0.0484 -0.1220 -0.3111 -0.2432 -0.1697 0.3410 -0.0330 0.1588 -0.2364 -0.2515 -0.1145 -0.0295 -0.0624 0.2202 -0.2435 -0.1578 -0.4115 0.0858 0.0961 0.0880 0.0916 0.0926 0.1007 0.0733 0.0921 0.0884 0.0944 0.1051 0.0811 0.0922 0.0992 0.0874 0.0862 0.0970 0.0856 0.0848 0.1037 0.0964 0.1210 0.1191 0.1191 0.2447
va: 2.0636 2.1371 2.1759 3.7236 3.8156 3.8598 3.9141 3.9077 3.8470 4.2208 3.7237 3.8136 3.9356 3.9554 3.8547 3.6634 3.4736 4.1308 3.9544 3.9189 3.8636 3.5830 1.0056 1.0272 1.0009 1.0141 1.0039 1.0084 1.0042 1.0043 1.0094 1.0314 1.0424 1.0266 1.0010 1.0071 0.9964 0.9994 1.0012 1.0079 0.9977 1.0036 1.0114 0.9852 1.0195 0.9734
dispcorr: -0.024955045 hartree
energy: -964.167800137923
dipole: -16.82744 15.76535 -1.06209 0.85416 -0.38481 0.46935 -8.38158 8.29723 -0.08435
magnitude: 1.16423 au
magnitude: 2.95924 debye
