program: Gaussian 09
title: 000067769
version: EM64L-G09RevD.01
frameworkgroup: C1[X(C6H5FN2O2)]
method: RPBEPBE
basis: SDD
operation: Freq
keyword: #p
keyword: freq=noraman
keyword: PBEPBE/SDD
title: #p freq=noraman PBEPBE/SDD
converged: NO YES NO YES
title: Mulliken charges:
elementType: F O O N N C C C C C C H H H H H
charge: -0.199263 -0.210260 -0.269099 0.024620 -0.658200 0.280399 0.354795 -0.498671 -0.326382 0.360381 -0.352468 0.310889 0.235250 0.263318 0.314834 0.369857
chargesum: 0.00000
title: Mulliken charges with hydrogens summed into heavy atoms:
elementType: F O O N N C C C C C C
charge: -0.199263 -0.210260 -0.269099 0.024620 0.026490 0.280399 0.354795 -0.187783 -0.091132 0.360381 -0.089149
polarizability: 1.25272938e+02 -4.34239100e+00 1.17708091e+02 -1.06704610e-02 -1.12106739e-02 3.42844746e+01
1716.lowfreq: -6.8999 -2.9990 -0.0012 -0.0009 -0.0002 4.8560 78.7511 135.7183 170.7134
frequency: 78.7502 135.7135 170.7124 230.7399 346.8645 353.1220 390.8194 395.2628 426.7364 449.1692 489.0736 534.3722 538.6339 663.3398 663.8851 711.6882 732.9635 735.2688 785.5693 810.5874 899.9565 908.6748 941.4387 1026.5065 1057.8765 1151.6759 1179.4885 1190.4597 1259.9519 1329.4911 1334.6533 1408.5562 1440.3187 1507.3458 1564.0365 1589.1936 1642.5627 3143.9472 3180.2407 3196.4666 3407.7122 3644.4897
redmass: 11.2011 5.4022 6.9279 13.3325 5.5669 4.4441 7.0010 8.2536 3.3724 9.4142 1.2355 4.4338 3.0095 5.3917 7.8299 2.4424 10.9317 1.5194 5.1356 1.4917 1.4121 6.0169 1.3256 1.7742 2.0181 1.3589 2.8559 5.4679 1.6423 6.4060 3.1829 4.7227 4.9029 3.3945 1.9491 2.6415 6.6611 1.0896 1.0964 1.0926 1.0542 1.0957
irintensity: 0.1497 0.2924 0.0075 3.7897 3.1206 3.4989 1.0934 2.1428 13.6126 4.9715 96.2835 1.2199 64.2509 2.0247 5.3990 28.5780 24.7999 129.0328 13.1600 37.1435 35.1241 30.1712 0.4644 0.7461 1.6995 15.3200 107.5114 292.9544 34.7467 104.2365 67.8005 30.3196 7.9458 197.2437 79.5056 160.9068 44.1087 7.7167 2.2022 12.1715 68.0527 64.9844
temp: 298.150 k
press: 1.00000 atm
elementType: 9 8 8 7 7 6 6 6 6 6 6 1 1 1 1 1
symmnumber: 1
zpe: 285000.2 jmol-1
zpe.correction: 0.108551 hartree
zpe.thermalcorrener: 0.117537 hartree
zpe.thermalcorrenthalpy: 0.118481 hartree
zpe.thermalcorrgfe: 0.074308 hartree
zpe.sumelectzpe: -590.565574 hartree
zpe.sumelectthermal: -590.556588 hartree
zpe.sumelectthermalent: -590.555644 hartree
zpe.sumelectthermalfe: -590.599817 hartree
dipole: -1.7025 5.6078 0.0021
dipole: 5.8605
quadrupole: -72.1574 -54.5818 -64.0248
quadrupole: 3.5430 0.0092 0.0045
quadrupole: -8.5694 9.0062 -0.4368 3.5430 0.0092 0.0045
hfenergy: -590.6741248 hartree
pointgroup: C01 [X(C6H5F1N2O2)]
dipole: -0.7581619 -2.1774849 -0.0008113 debye
dipolederiv: -0.8695292 0.368962 -0.0001163 0.5342898 -0.4426154 0.00009 -0.0001271 0.0000639 -0.1444529 -0.461712 -0.1240513 -0.0000203 -0.2689461 -1.0363457 0.0001707 0.0000338 0.0003841 -0.2328748 -0.9252195 0.016235 -0.0002282 0.280802 -0.4107061 0.000308 -0.000134 0.0000488 -0.2782499 1.5935236 0.5658283 0.0003966 0.3370296 1.3519679 -0.0004884 0.0003616 -0.0004914 0.1900467 -0.6930359 0.6934878 -0.0002718 0.4050458 -0.7862444 -0.0001619 -0.0004151 0.0002468 -0.6332476 -0.6725013 -0.667455 -0.0000442 -0.075192 -0.3539072 0.0000151 -0.0002026 0.0000104 -0.0111534 0.6628485 -0.8389734 0.0000499 -0.3068141 0.6082089 0.0001272 -0.0002305 0.0000677 0.1578118 0.195504 0.4419922 -0.0000387 -0.2118889 -0.1435143 -0.0000261 0.0001649 0.0001226 -0.0944141 -0.1677696 0.5373169 -0.0000325 -0.0444289 0.0821328 -0.0000063 0.0001018 -0.000167 -0.1973026 0.6812652 -0.7270298 0.0001479 -0.8228297 0.1748527 -0.0001111 0.0001451 -0.0001182 0.0492041 0.0024213 -0.1272822 0.0000217 0.3333647 0.3555165 -0.000031 -0.0000369 -0.0000394 -0.0955797 0.1396376 -0.0468618 0.0000042 0.0301903 0.0961654 0.0000065 -0.000015 0.0000273 0.1945171 0.0707216 0.0313148 -0.0000118 -0.0222997 -0.0903408 0.0000116 0.0000187 -0.0000401 0.1678993 -0.0102773 -0.0471445 -0.0000052 -0.0434021 0.1035738 0.0000102 -0.000013 0.0000497 0.1724247 0.1966974 -0.0741765 0.0001236 -0.0546036 0.228272 0.0000186 0.0001641 -0.0001354 0.3744097 0.2574257 -0.0021625 0.000025 -0.0703173 0.2629839 0.0000669 0.000184 -0.0000299 0.3809617 unknown
polarizability: 125.6103287|4.0237072|117.3707007|0.0102101|-0.0116315|34.2844746 unknown
InChI: InChI=1S/C6H5FN2O2/c7-4-1-2-5(8)6(3-4)9(10)11/h1-3H,8H2
charge 0 multiplicity 1
16 atoms
F  -3.034903 1.350659 -0.000348
O  1.883513 2.104945 -0.000295
O  2.868649 0.050661 0.001073
N  1.801925 0.815602 0.000453
N  1.38878 -2.119769 0.000128
C  0.485505 0.187843 0.000111
C  0.327681 -1.246114 0.000238
C  -0.637571 1.059621 -0.000132
C  -1.017661 -1.749173 0.000288
C  -1.910626 0.503518 -0.000154
C  -2.124203 -0.89649 0.000085
H  -0.476186 2.139791 -0.000203
H  -1.168831 -2.834143 0.000381
H  -3.144636 -1.29016 0.000078
H  1.227712 -3.124204 0.000234
H  2.33445 -1.719086 -0.000936
