program: Orca
programVersion: 5.0.2
elementType: O O O C C C C C C C C C C C C C C C C C C C H H H H H H H H H H H H H H H H H H H H H H H H
charge: 0
multiplicity: 1
keywords: wb97x-d3
keywords: def2-TZVPP
keywords: def2/J RIJCOSX
keywords: DEFGRID2
keywords: scfconv7
keywords: smallprint printgap noloewdin
keywords: NOSOSCF
formula: C19H24O3
InChI: InChI=1/C19H24O3/c1-7-8-13-12(4)16(10-15(13)20)22-18(21)17-14(9-11(2)3)19(17,5)6/h1,9,14,16-17H,8,10H2,2-6H3
46 atoms
O  0.379801 -1.127758 -0.181358
O  -0.609406 -0.712466 1.786932
O  4.917718 -1.462593 -1.065458
C  -3.18553 -1.735999 0.318719
C  -3.147426 -0.243634 0.285409
C  -1.930923 -1.040921 -0.181659
C  -3.207742 -2.425227 1.66115
C  -3.957168 -2.495218 -0.734708
C  -3.902415 0.573841 -0.682184
C  -0.690488 -0.945417 0.601841
C  -4.193729 1.873853 -0.558153
C  1.689153 -0.962023 0.366836
C  -4.990165 2.582916 -1.612246
C  -3.777459 2.742344 0.58992
C  2.667663 -1.930902 -0.280625
C  2.22749 0.410437 0.043971
C  3.448557 0.337504 -0.506679
C  3.838356 -1.064687 -0.674324
C  1.464702 1.63361 0.384039
C  4.345629 1.476559 -0.891305
C  4.891732 2.164205 0.272502
C  5.327138 2.72868 1.240221
H  -3.005773 0.206676 1.261802
H  -1.781599 -1.09468 -1.253791
H  -4.242214 -2.62892 1.943761
H  -2.765556 -1.832518 2.458107
H  -2.686315 -3.383276 1.618669
H  -5.019472 -2.523872 -0.485185
H  -3.602855 -3.525946 -0.789161
H  -3.858768 -2.0659 -1.73071
H  -4.247085 0.067208 -1.578422
H  1.663559 -1.098109 1.449928
H  2.244334 -2.379993 -1.182513
H  2.975076 -2.742507 0.378216
H  -4.416372 3.40375 -2.050268
H  -5.295928 1.916171 -2.418159
H  -5.890887 3.031655 -1.185339
H  -3.25408 3.628305 0.222075
H  -4.651797 3.108113 1.134602
H  -3.122166 2.248846 1.304686
H  1.285414 1.681873 1.460194
H  0.485617 1.632203 -0.0999
H  1.984142 2.541007 0.08345
H  5.167267 1.106535 -1.508515
H  3.800171 2.194463 -1.508684
H  5.71265 3.226971 2.101147
elementType: O C H
totalener: -964.16348613 hartree
nucrepener: 1749.34210286 hartree
electener: -2713.50558899 hartree
oneelecener: -4783.25421207 hartree
twoeener: 2069.74862308 hartree
cpcmener: -0.03830114 hartree
kineticenergy: 959.76080774 hartree
xcener: -94.697352939457 hartree
chargesum: -0.0000000
charge: -0.298378 -0.497654 -0.481231 0.117900 -0.006175 -0.073010 -0.275409 -0.289784 -0.269250 0.395851 -0.031369 0.258169 -0.224337 -0.261422 -0.138658 -0.027586 -0.094046 0.315696 -0.242452 -0.105296 -0.463099 0.045159 0.102429 0.091812 0.096645 0.090881 0.099002 0.101879 0.098231 0.092123 0.119471 0.107399 0.105599 0.100452 0.094427 0.089264 0.093331 0.095820 0.100567 0.090034 0.119579 0.116271 0.100942 0.111900 0.136365 0.291960
qa: -0.2984 -0.4977 -0.4812 0.1179 -0.0062 -0.0730 -0.2754 -0.2898 -0.2692 0.3959 -0.0314 0.2582 -0.2243 -0.2614 -0.1387 -0.0276 -0.0940 0.3157 -0.2425 -0.1053 -0.4631 0.0452 0.1024 0.0918 0.0966 0.0909 0.0990 0.1019 0.0982 0.0921 0.1195 0.1074 0.1056 0.1005 0.0944 0.0893 0.0933 0.0958 0.1006 0.0900 0.1196 0.1163 0.1009 0.1119 0.1364 0.2920
va: 2.1236 2.0012 2.0165 3.7238 3.8111 3.8094 3.8973 3.9163 3.8968 4.1665 3.7414 3.7471 3.9238 3.9402 3.9251 3.7576 3.5280 4.0268 3.9363 3.8750 3.8192 3.5269 1.0212 1.0352 0.9997 1.0194 0.9994 0.9996 1.0013 1.0054 1.0107 1.0315 1.0265 1.0241 0.9965 1.0083 0.9952 0.9968 0.9968 1.0115 1.0021 1.0013 1.0027 1.0187 0.9884 0.9437
dispcorr: -0.021056071 hartree
energy: -964.184542204008
dipole: -30.83294 28.45255 -2.38039 6.39435 -5.59942 0.79493 -0.64129 0.19316 -0.44813
magnitude: 2.54931 au
magnitude: 6.47983 debye
