program: Orca
programVersion: 5.0.2
elementType: O O O C C C C C C C C C C C C C C C C C C C H H H H H H H H H H H H H H H H H H H H H H H H
charge: 0
multiplicity: 1
keywords: wb97x-d3
keywords: def2-TZVPP
keywords: def2/J RIJCOSX
keywords: DEFGRID2
keywords: scfconv7
keywords: smallprint printgap noloewdin
keywords: NOSOSCF
formula: C19H24O3
InChI: InChI=1/C19H24O3/c1-7-8-13-12(4)16(10-15(13)20)22-18(21)17-14(9-11(2)3)19(17,5)6/h1,9,14,16-17H,8,10H2,2-6H3
46 atoms
O  0.527747 -0.86522 -0.09815
O  -0.655409 -0.790631 1.806069
O  4.963412 -1.649717 -0.926458
C  -3.000807 -1.427766 -0.216458
C  -3.05513 0.012265 0.1944
C  -1.750753 -0.56593 -0.312501
C  -3.127775 -2.485085 0.85182
C  -3.609575 -1.844303 -1.53298
C  -3.737824 1.039406 -0.621645
C  -0.607415 -0.746671 0.597868
C  -4.735363 1.835451 -0.223901
C  1.765407 -1.10008 0.5812
C  -5.334145 2.839664 -1.162432
C  -5.351173 1.810506 1.141294
C  2.654423 -2.000181 -0.266005
C  2.539835 0.186144 0.731433
C  3.76995 0.083413 0.206601
C  3.947579 -1.236385 -0.403282
C  1.950122 1.360558 1.413229
C  4.845491 1.127462 0.196554
C  4.596252 2.157164 -0.805395
C  4.370804 3.002159 -1.630169
H  -3.090117 0.160444 1.268891
H  -1.472398 -0.295213 -1.325116
H  -2.559584 -3.379712 0.58956
H  -4.174735 -2.779128 0.94633
H  -2.797685 -2.149991 1.832389
H  -3.443732 -1.115964 -2.325543
H  -4.687492 -1.98093 -1.426093
H  -3.187254 -2.79449 -1.864445
H  -3.387376 1.143373 -1.644685
H  1.57632 -1.535798 1.564346
H  2.22865 -2.169724 -1.25737
H  2.826337 -2.977375 0.185779
H  -5.251606 3.851745 -0.757792
H  -4.85322 2.827437 -2.140262
H  -6.401287 2.652812 -1.307713
H  -5.287713 2.794557 1.612495
H  -6.415712 1.571923 1.072934
H  -4.895626 1.087214 1.814809
H  1.571152 1.083914 2.398481
H  1.101337 1.748589 0.845268
H  2.667212 2.170198 1.532759
H  4.926204 1.597888 1.179373
H  5.812954 0.659503 0.000772
H  4.164674 3.752253 -2.36019
elementType: O C H
totalener: -964.16402143 hartree
nucrepener: 1740.07441521 hartree
electener: -2704.23843664 hartree
oneelecener: -4764.86965422 hartree
twoeener: 2060.63121758 hartree
cpcmener: -0.03885891 hartree
kineticenergy: 959.76254169 hartree
xcener: -94.696245041281 hartree
chargesum: -0.0000000
charge: -0.293622 -0.497398 -0.480815 0.124072 0.037748 -0.129083 -0.284504 -0.265796 -0.287291 0.420442 -0.043024 0.251969 -0.222521 -0.252243 -0.136517 -0.022186 -0.100047 0.316605 -0.246135 -0.101995 -0.459484 0.040049 0.094563 0.088831 0.101181 0.097739 0.090607 0.089307 0.097252 0.097959 0.123146 0.106256 0.103884 0.103464 0.094215 0.089224 0.093825 0.096111 0.096794 0.090285 0.119011 0.117119 0.102100 0.135164 0.111558 0.292179
qa: -0.2936 -0.4974 -0.4808 0.1241 0.0377 -0.1291 -0.2845 -0.2658 -0.2873 0.4204 -0.0430 0.2520 -0.2225 -0.2522 -0.1365 -0.0222 -0.1000 0.3166 -0.2461 -0.1020 -0.4595 0.0400 0.0946 0.0888 0.1012 0.0977 0.0906 0.0893 0.0973 0.0980 0.1231 0.1063 0.1039 0.1035 0.0942 0.0892 0.0938 0.0961 0.0968 0.0903 0.1190 0.1171 0.1021 0.1352 0.1116 0.2922
va: 2.1292 2.0018 2.0186 3.6787 3.7624 3.8946 3.9072 3.9062 3.8683 4.1399 3.7398 3.7483 3.9215 3.9431 3.9157 3.7496 3.5380 4.0276 3.9349 3.8778 3.8288 3.5323 1.0307 1.0404 0.9988 1.0004 1.0184 1.0046 1.0025 1.0024 1.0082 1.0300 1.0289 1.0223 0.9959 1.0086 0.9962 0.9971 0.9970 1.0091 1.0058 0.9984 1.0038 0.9888 1.0187 0.9436
dispcorr: -0.020902022 hartree
energy: -964.184923450063
dipole: -32.46094 30.42406 -2.03687 5.38051 -4.73146 0.64905 0.58466 -0.21273 0.37192
magnitude: 2.16990 au
magnitude: 5.51544 debye
