program: Orca
programVersion: 5.0.2
elementType: O O O C C C C C C C C C C C C C C C C C C C H H H H H H H H H H H H H H H H H H H H H H H H
charge: 0
multiplicity: 1
keywords: wb97x-d3
keywords: def2-TZVPP
keywords: def2/J RIJCOSX
keywords: DEFGRID2
keywords: scfconv7
keywords: smallprint printgap noloewdin
keywords: NOSOSCF
formula: C19H24O3
InChI: InChI=1/C19H24O3/c1-7-8-13-12(4)16(10-15(13)20)22-18(21)17-14(9-11(2)3)19(17,5)6/h1,9,14,16-17H,8,10H2,2-6H3
46 atoms
O  0.472309 -0.892643 -0.20248
O  -0.497896 -0.261363 1.717692
O  4.954083 -1.808656 -0.96531
C  -3.058627 -1.362378 0.236212
C  -3.049993 0.134292 0.217404
C  -1.822444 -0.614955 -0.245442
C  -3.063487 -2.071638 1.56682
C  -3.830237 -2.095764 -0.832515
C  -3.828501 0.920631 -0.770874
C  -0.583931 -0.561304 0.548677
C  -4.987314 1.535031 -0.517716
C  1.780957 -0.874778 0.372258
C  -5.694114 2.326255 -1.575284
C  -5.679357 1.489125 0.809458
C  2.64376 -1.970621 -0.23635
C  2.496438 0.411886 0.04142
C  3.713831 0.17496 -0.470678
C  3.925772 -1.268114 -0.60821
C  1.886738 1.728191 0.339924
C  4.757449 1.183866 -0.848975
C  5.26288 1.921472 0.302421
C  5.663677 2.53011 1.258441
H  -2.95196 0.58662 1.200053
H  -1.662959 -0.655073 -1.317514
H  -4.093153 -2.291516 1.854937
H  -2.622683 -1.484283 2.369026
H  -2.530664 -3.022839 1.508979
H  -3.459842 -3.116506 -0.942612
H  -3.762995 -1.611757 -1.806249
H  -4.886838 -2.154278 -0.563397
H  -3.414369 0.994461 -1.77239
H  1.715418 -0.985788 1.45669
H  2.18906 -2.374935 -1.144109
H  2.827284 -2.80503 0.439824
H  -5.836791 3.362537 -1.258208
H  -5.147264 2.33455 -2.517864
H  -6.691931 1.92276 -1.76535
H  -5.805282 2.494539 1.218924
H  -6.685055 1.075696 0.698346
H  -5.155923 0.88726 1.550276
H  1.718578 1.833261 1.413907
H  0.91341 1.828204 -0.144469
H  2.509339 2.556759 0.009827
H  5.590281 0.682866 -1.34715
H  4.350365 1.891672 -1.575857
H  6.021985 3.071882 2.104735
elementType: O C H
totalener: -964.16297780 hartree
nucrepener: 1736.29572741 hartree
electener: -2700.45870521 hartree
oneelecener: -4757.21167672 hartree
twoeener: 2056.75297151 hartree
cpcmener: -0.03771573 hartree
kineticenergy: 959.76576921 hartree
xcener: -94.697229695290 hartree
chargesum: 0.0000000
charge: -0.295833 -0.494866 -0.481758 0.149837 -0.005117 -0.132497 -0.297694 -0.267733 -0.267717 0.414169 -0.036746 0.261938 -0.229704 -0.251452 -0.138269 -0.026613 -0.096015 0.315110 -0.247991 -0.095738 -0.467296 0.045497 0.099378 0.091310 0.096914 0.092397 0.102683 0.099449 0.091765 0.096533 0.124203 0.106397 0.105150 0.100734 0.095009 0.089989 0.094696 0.099648 0.096580 0.087888 0.120591 0.117137 0.100714 0.108758 0.136428 0.292135
qa: -0.2958 -0.4949 -0.4818 0.1498 -0.0051 -0.1325 -0.2977 -0.2677 -0.2677 0.4142 -0.0367 0.2619 -0.2297 -0.2515 -0.1383 -0.0266 -0.0960 0.3151 -0.2480 -0.0957 -0.4673 0.0455 0.0994 0.0913 0.0969 0.0924 0.1027 0.0994 0.0918 0.0965 0.1242 0.1064 0.1051 0.1007 0.0950 0.0900 0.0947 0.0996 0.0966 0.0879 0.1206 0.1171 0.1007 0.1088 0.1364 0.2921
va: 2.1285 2.0028 2.0166 3.6715 3.7758 3.9143 3.9038 3.9054 3.8694 4.1600 3.7034 3.7349 3.9265 3.9420 3.9272 3.7540 3.5350 4.0231 3.9376 3.8735 3.8209 3.5240 1.0246 1.0393 1.0006 1.0178 0.9989 1.0030 1.0022 1.0022 1.0065 1.0310 1.0269 1.0242 0.9952 1.0075 0.9961 0.9980 0.9973 1.0081 1.0013 1.0024 1.0018 1.0211 0.9879 0.9436
dispcorr: -0.021349423 hartree
energy: -964.184327223879
dipole: -34.52314 32.08858 -2.43455 4.65663 -3.91299 0.74364 -0.56436 0.11156 -0.45280
magnitude: 2.58555 au
magnitude: 6.57195 debye
