program: Orca
programVersion: 5.0.2
elementType: O O O C C C C C C C C C C C C C C C C C C C H H H H H H H H H H H H H H H H H H H H H H H H
charge: 0
multiplicity: 1
keywords: wb97x-d3
keywords: def2-TZVPP
keywords: def2/J RIJCOSX
keywords: DEFGRID2
keywords: scfconv7
keywords: smallprint printgap noloewdin
keywords: NOSOSCF
formula: C19H24O3
InChI: InChI=1/C19H24O3/c1-7-8-13-12(4)16(10-15(13)20)22-18(21)17-14(9-11(2)3)19(17,5)6/h1,9,14,16-17H,8,10H2,2-6H3
46 atoms
O  0.454569 -0.878748 -0.191041
O  -0.530021 -0.237691 1.718925
O  4.933654 -1.742527 -0.988919
C  -3.058504 -1.421696 0.223762
C  -3.095442 0.075723 0.207901
C  -1.841715 -0.63707 -0.245466
C  -3.055982 -2.128372 1.555647
C  -3.794055 -2.181871 -0.85204
C  -3.886394 0.83712 -0.786991
C  -0.607938 -0.555378 0.554114
C  -4.984862 1.55137 -0.525478
C  1.762532 -0.848491 0.384813
C  -5.702191 2.290688 -1.613904
C  -5.603591 1.676395 0.832505
C  2.634053 -1.932797 -0.232653
C  2.465969 0.447007 0.061022
C  3.679699 0.224528 -0.465883
C  3.904509 -1.215183 -0.615229
C  1.852965 1.756479 0.381233
C  4.710039 1.24683 -0.843716
C  5.317092 1.87481 0.323186
C  5.809596 2.40022 1.285067
H  -3.020676 0.526828 1.192639
H  -1.67449 -0.671539 -1.316555
H  -2.51637 -3.075736 1.498648
H  -4.083602 -2.354803 1.846193
H  -2.617815 -1.536249 2.355959
H  -3.730698 -1.699674 -1.82681
H  -4.851144 -2.275862 -0.59579
H  -3.38803 -3.189764 -0.954365
H  -3.535972 0.798245 -1.814202
H  1.698195 -0.967048 1.468637
H  2.176566 -2.342272 -1.136665
H  2.833267 -2.765541 0.441156
H  -6.731672 1.93812 -1.714385
H  -5.763864 3.357979 -1.388023
H  -5.211706 2.178608 -2.580092
H  -5.068972 1.130866 1.607524
H  -5.662727 2.723778 1.137235
H  -6.630932 1.304357 0.815739
H  1.690421 1.844919 1.457515
H  0.87688 1.861683 -0.096351
H  2.472386 2.59143 0.060825
H  5.491058 0.780302 -1.447092
H  4.261439 2.019714 -1.471891
H  6.246651 2.857049 2.14437
elementType: O C H
totalener: -964.16349551 hartree
nucrepener: 1734.37802899 hartree
electener: -2698.54152450 hartree
oneelecener: -4753.37417317 hartree
twoeener: 2054.83264867 hartree
cpcmener: -0.03840026 hartree
kineticenergy: 959.77078252 hartree
xcener: -94.698101180827 hartree
chargesum: 0.0000000
charge: -0.294093 -0.495029 -0.481430 0.147215 0.012507 -0.141134 -0.291354 -0.263281 -0.279574 0.415874 -0.033898 0.257607 -0.226981 -0.253008 -0.137869 -0.026663 -0.096023 0.316856 -0.244931 -0.106010 -0.465278 0.048592 0.096596 0.090390 0.101071 0.096985 0.091282 0.090244 0.096581 0.098696 0.123964 0.106725 0.104841 0.100890 0.094247 0.094638 0.089709 0.089497 0.097255 0.096510 0.120060 0.116896 0.100574 0.111692 0.137239 0.291322
qa: -0.2941 -0.4950 -0.4814 0.1472 0.0125 -0.1411 -0.2914 -0.2633 -0.2796 0.4159 -0.0339 0.2576 -0.2270 -0.2530 -0.1379 -0.0267 -0.0960 0.3169 -0.2449 -0.1060 -0.4653 0.0486 0.0966 0.0904 0.1011 0.0970 0.0913 0.0902 0.0966 0.0987 0.1240 0.1067 0.1048 0.1009 0.0942 0.0946 0.0897 0.0895 0.0973 0.0965 0.1201 0.1169 0.1006 0.1117 0.1372 0.2913
va: 2.1290 2.0025 2.0168 3.6743 3.7647 3.9211 3.9063 3.9038 3.8739 4.1507 3.7129 3.7424 3.9242 3.9440 3.9265 3.7598 3.5277 4.0274 3.9365 3.8743 3.8201 3.5261 1.0274 1.0405 0.9992 1.0005 1.0181 1.0031 1.0028 1.0029 1.0071 1.0303 1.0273 1.0239 0.9963 0.9955 1.0081 1.0083 0.9977 0.9972 1.0014 1.0017 1.0030 1.0187 0.9881 0.9440
dispcorr: -0.021114001 hartree
energy: -964.184609510855
dipole: -34.30243 31.88476 -2.41767 4.61445 -3.89107 0.72338 -0.57632 0.15742 -0.41890
magnitude: 2.55810 au
magnitude: 6.50218 debye
