program: Orca
programVersion: 5.0.2
elementType: O O O C C C C C C C C C C C C C C C C C C C H H H H H H H H H H H H H H H H H H H H H H H H
charge: 0
multiplicity: 1
keywords: wb97x-d3
keywords: def2-TZVPP
keywords: def2/J RIJCOSX
keywords: DEFGRID2
keywords: scfconv7
keywords: smallprint printgap noloewdin
keywords: NOSOSCF
formula: C19H24O3
InChI: InChI=1/C19H24O3/c1-7-8-13-12(4)16(10-15(13)20)22-18(21)17-14(9-11(2)3)19(17,5)6/h1,9,14,16-17H,8,10H2,2-6H3
46 atoms
O  0.506268 -0.995531 -0.113732
O  -0.694754 -0.974756 1.778207
O  5.013074 -1.549135 -0.810416
C  -3.065535 -1.543842 -0.203869
C  -3.052505 -0.093135 0.167273
C  -1.779353 -0.746584 -0.343193
C  -3.22453 -2.563902 0.89713
C  -3.708354 -1.976609 -1.500093
C  -3.701159 0.95024 -0.649951
C  -0.637921 -0.918604 0.572905
C  -4.453286 1.96193 -0.203282
C  1.745137 -1.147234 0.584705
C  -5.042528 2.955538 -1.159732
C  -4.788395 2.214338 1.234883
C  2.699374 -2.007484 -0.232354
C  2.439148 0.186495 0.720818
C  3.685455 0.143631 0.228551
C  3.958737 -1.180753 -0.340013
C  1.763016 1.341031 1.356447
C  4.699538 1.24724 0.210175
C  4.42735 2.213769 -0.847248
C  4.181179 3.009372 -1.71376
H  -3.049793 0.081219 1.237793
H  -1.500303 -0.5151 -1.365258
H  -2.687963 -3.485365 0.660745
H  -4.280555 -2.820099 1.004743
H  -2.877044 -2.211132 1.865491
H  -3.346342 -2.964056 -1.793108
H  -3.503728 -1.297633 -2.326969
H  -4.79235 -2.043612 -1.385725
H  -3.539504 0.88349 -1.721988
H  1.567073 -1.576019 1.573334
H  2.308668 -2.196467 -1.235127
H  2.904569 -2.975746 0.225183
H  -4.701662 3.969391 -0.932368
H  -4.780772 2.738826 -2.195459
H  -6.133297 2.974046 -1.085317
H  -4.353456 1.494449 1.925332
H  -4.453665 3.209602 1.539217
H  -5.871483 2.197349 1.382966
H  1.373451 1.069678 2.339398
H  0.909242 1.667503 0.757274
H  2.427793 2.195035 1.472798
H  4.718889 1.76386 1.172984
H  5.698204 0.827145 0.067835
H  3.974157 3.71712 -2.484619
elementType: O C H
totalener: -964.17443170 hartree
nucrepener: 1744.63303883 hartree
electener: -2708.80747053 hartree
oneelecener: -4773.97076597 hartree
twoeener: 2065.16329544 hartree
cpcmener: -0.03174049 hartree
kineticenergy: 959.76053531 hartree
xcener: -94.693894205145 hartree
chargesum: -0.0000000
charge: -0.290827 -0.469284 -0.444403 0.100751 0.041110 -0.095964 -0.277167 -0.270586 -0.273648 0.386249 -0.051562 0.248461 -0.217174 -0.251343 -0.133373 -0.029800 -0.093598 0.289477 -0.245444 -0.104943 -0.454266 0.043883 0.094622 0.086499 0.098221 0.096142 0.092063 0.096594 0.087678 0.097960 0.116334 0.104798 0.101366 0.100027 0.093130 0.087688 0.092597 0.089877 0.095032 0.095707 0.118441 0.114885 0.101918 0.131711 0.112926 0.287232
qa: -0.2908 -0.4693 -0.4444 0.1008 0.0411 -0.0960 -0.2772 -0.2706 -0.2736 0.3862 -0.0516 0.2485 -0.2172 -0.2513 -0.1334 -0.0298 -0.0936 0.2895 -0.2454 -0.1049 -0.4543 0.0439 0.0946 0.0865 0.0982 0.0961 0.0921 0.0966 0.0877 0.0980 0.1163 0.1048 0.1014 0.1000 0.0931 0.0877 0.0926 0.0899 0.0950 0.0957 0.1184 0.1149 0.1019 0.1317 0.1129 0.2872
va: 2.1281 2.0354 2.0628 3.6957 3.7708 3.8511 3.9054 3.9123 3.8759 4.1809 3.7690 3.7545 3.9207 3.9410 3.9006 3.7486 3.5197 4.0637 3.9365 3.8844 3.8355 3.5371 1.0315 1.0380 0.9992 1.0001 1.0193 1.0021 1.0065 1.0015 1.0120 1.0308 1.0293 1.0237 0.9962 1.0091 0.9963 1.0107 0.9969 0.9972 1.0061 0.9989 1.0036 0.9892 1.0179 0.9469
dispcorr: -0.020809992 hartree
energy: -964.195241689293
dipole: -31.56396 29.62603 -1.93793 6.30913 -5.63142 0.67771 0.69048 -0.37749 0.31300
magnitude: 2.07674 au
magnitude: 5.27864 debye
