program: Orca
programVersion: 5.0.2
elementType: O O O C C C C C C C C C C C C C C C C C C C H H H H H H H H H H H H H H H H H H H H H H H H
charge: 0
multiplicity: 1
keywords: wb97x-d3
keywords: def2-TZVPP
keywords: def2/J RIJCOSX
keywords: DEFGRID2
keywords: scfconv7
keywords: smallprint printgap noloewdin
keywords: NOSOSCF
formula: C19H24O3
InChI: InChI=1/C19H24O3/c1-7-8-13-12(4)16(10-15(13)20)22-18(21)17-14(9-11(2)3)19(17,5)6/h1,9,14,16-17H,8,10H2,2-6H3
46 atoms
O  0.371562 -1.129394 -0.179484
O  -0.621685 -0.722496 1.7873
O  4.914977 -1.486968 -1.035379
C  -3.18834 -1.751293 0.304496
C  -3.159359 -0.258263 0.291334
C  -1.938319 -1.041412 -0.185692
C  -3.203707 -2.458429 1.637867
C  -3.95678 -2.50026 -0.758847
C  -3.925699 0.570084 -0.659211
C  -0.698668 -0.950065 0.603105
C  -4.153398 1.883664 -0.547867
C  1.679302 -0.964375 0.370205
C  -4.982356 2.607669 -1.565999
C  -3.634161 2.749978 0.560052
C  2.65636 -1.941135 -0.267969
C  2.223516 0.404097 0.038177
C  3.448669 0.323562 -0.501352
C  3.837404 -1.083116 -0.655428
C  1.457561 1.630833 0.360857
C  4.354759 1.454823 -0.890146
C  4.82943 2.206572 0.265269
C  5.206431 2.819004 1.228147
H  -3.019012 0.178476 1.274222
H  -1.785778 -1.080004 -1.258298
H  -2.682072 -3.416152 1.581168
H  -4.236222 -2.666101 1.926245
H  -2.754719 -1.876634 2.43937
H  -3.6003 -3.529899 -0.826472
H  -3.858323 -2.060164 -1.750572
H  -5.020232 -2.535187 -0.513179
H  -4.341637 0.060602 -1.523086
H  1.649176 -1.091714 1.454743
H  2.234721 -2.388826 -1.171747
H  2.954454 -2.75446 0.393545
H  -4.401419 3.38984 -2.062329
H  -5.372371 1.939612 -2.334136
H  -5.832363 3.109114 -1.094884
H  -3.152669 3.64161 0.150859
H  -4.452818 3.107318 1.191051
H  -2.909003 2.255999 1.204194
H  1.975735 2.536237 0.051303
H  1.273796 1.694579 1.435846
H  0.479984 1.6235 -0.126832
H  5.212854 1.063974 -1.441831
H  3.838824 2.134742 -1.573405
H  5.544617 3.361825 2.082197
elementType: O C H
totalener: -964.17341922 hartree
nucrepener: 1751.16308821 hartree
electener: -2715.33650743 hartree
oneelecener: -4786.88583907 hartree
twoeener: 2071.54933163 hartree
cpcmener: -0.03100375 hartree
kineticenergy: 959.75493272 hartree
xcener: -94.693680783769 hartree
chargesum: 0.0000000
charge: -0.293764 -0.469897 -0.444964 0.117864 -0.014035 -0.062654 -0.273299 -0.291613 -0.260264 0.368767 -0.023400 0.253344 -0.225944 -0.264410 -0.136356 -0.033337 -0.086353 0.288076 -0.242220 -0.106189 -0.459626 0.048690 0.100987 0.090136 0.096958 0.095302 0.092715 0.097843 0.089622 0.102822 0.115214 0.105935 0.102574 0.097871 0.093927 0.087933 0.092515 0.093844 0.101842 0.088599 0.099376 0.119047 0.113562 0.111473 0.134077 0.287415
qa: -0.2938 -0.4699 -0.4450 0.1179 -0.0140 -0.0627 -0.2733 -0.2916 -0.2603 0.3688 -0.0234 0.2533 -0.2259 -0.2644 -0.1364 -0.0333 -0.0864 0.2881 -0.2422 -0.1062 -0.4596 0.0487 0.1010 0.0901 0.0970 0.0953 0.0927 0.0978 0.0896 0.1028 0.1152 0.1059 0.1026 0.0979 0.0939 0.0879 0.0925 0.0938 0.1018 0.0886 0.0994 0.1190 0.1136 0.1115 0.1341 0.2874
va: 2.1230 2.0341 2.0611 3.7447 3.8137 3.8003 3.8960 3.9172 3.9039 4.2010 3.7341 3.7533 3.9279 3.9427 3.9110 3.7487 3.5134 4.0596 3.9387 3.8777 3.8246 3.5306 1.0219 1.0350 0.9998 0.9999 1.0196 1.0017 1.0049 0.9992 1.0112 1.0319 1.0272 1.0252 0.9965 1.0085 0.9951 0.9974 0.9968 1.0112 1.0027 1.0022 1.0019 1.0200 0.9879 0.9467
dispcorr: -0.021154558 hartree
energy: -964.194573776561
dipole: -30.51592 28.30560 -2.21032 6.40021 -5.65328 0.74693 -0.76724 0.33699 -0.43025
magnitude: 2.37246 au
magnitude: 6.03030 debye
