program: Orca
programVersion: 5.0.2
elementType: O O O C C C C C C C C C C C C C C C C C C C H H H H H H H H H H H H H H H H H H H H H H H H
charge: 0
multiplicity: 1
keywords: wb97x-d3
keywords: def2-TZVPP
keywords: def2/J RIJCOSX
keywords: DEFGRID2
keywords: scfconv7
keywords: smallprint printgap noloewdin
keywords: NOSOSCF
formula: C19H24O3
InChI: InChI=1/C19H24O3/c1-7-8-13-12(4)16(10-15(13)20)22-18(21)17-14(9-11(2)3)19(17,5)6/h1,9,14,16-17H,8,10H2,2-6H3
46 atoms
O  0.382033 -1.124955 -0.171208
O  -0.614998 -0.725897 1.795291
O  4.909913 -1.480135 -1.067884
C  -3.183609 -1.736345 0.303879
C  -3.145327 -0.24291 0.284269
C  -1.927075 -1.036215 -0.18267
C  -3.212012 -2.436748 1.640532
C  -3.951856 -2.485502 -0.759556
C  -3.896852 0.582604 -0.679322
C  -0.689508 -0.948415 0.610031
C  -4.193999 1.880274 -0.545865
C  1.690017 -0.96419 0.380226
C  -4.98725 2.595017 -1.598812
C  -3.788911 2.739742 0.613172
C  2.665147 -1.939322 -0.263619
C  2.233332 0.405491 0.051699
C  3.450922 0.327278 -0.504714
C  3.837716 -1.07863 -0.670594
C  1.472415 1.630935 0.390984
C  4.350991 1.460388 -0.901584
C  4.870303 2.186053 0.251182
C  5.287081 2.782172 1.20815
H  -3.008668 0.198309 1.265569
H  -1.770253 -1.079771 -1.254483
H  -2.69869 -3.399361 1.591009
H  -4.247986 -2.633834 1.923887
H  -2.762248 -1.855509 2.44189
H  -5.016582 -2.512746 -0.518532
H  -3.60125 -3.517531 -0.820834
H  -3.846512 -2.050761 -1.752822
H  -4.235466 0.083455 -1.582127
H  1.659249 -1.095883 1.46417
H  2.235844 -2.396657 -1.158867
H  2.975389 -2.746186 0.400396
H  -4.415403 3.422782 -2.027226
H  -5.284388 1.93467 -2.413633
H  -5.894356 3.035363 -1.175876
H  -4.667351 3.103076 1.15239
H  -3.142403 2.240198 1.331327
H  -3.259045 3.627531 0.259384
H  1.995035 2.538397 0.095105
H  1.286989 1.680007 1.466385
H  0.495645 1.634438 -0.098427
H  5.187215 1.075168 -1.489769
H  3.816848 2.156925 -1.553194
H  5.657209 3.314812 2.055044
elementType: O C H
totalener: -964.17363632 hartree
nucrepener: 1749.11357759 hartree
electener: -2713.28721391 hartree
oneelecener: -4782.78900829 hartree
twoeener: 2069.50179438 hartree
cpcmener: -0.03120241 hartree
kineticenergy: 959.75680968 hartree
xcener: -94.694053265730 hartree
chargesum: 0.0000000
charge: -0.293364 -0.469378 -0.444871 0.114571 -0.004851 -0.071121 -0.273282 -0.288677 -0.260731 0.372519 -0.032295 0.252931 -0.222973 -0.260162 -0.137072 -0.034976 -0.086179 0.289277 -0.241127 -0.108451 -0.459789 0.049760 0.101453 0.089524 0.096809 0.095265 0.092380 0.101828 0.097458 0.090255 0.114728 0.106129 0.102492 0.098277 0.093395 0.088063 0.092588 0.099560 0.089698 0.094663 0.099002 0.118780 0.114085 0.112259 0.134161 0.287388
qa: -0.2934 -0.4694 -0.4449 0.1146 -0.0049 -0.0711 -0.2733 -0.2887 -0.2607 0.3725 -0.0323 0.2529 -0.2230 -0.2602 -0.1371 -0.0350 -0.0862 0.2893 -0.2411 -0.1085 -0.4598 0.0498 0.1015 0.0895 0.0968 0.0953 0.0924 0.1018 0.0975 0.0903 0.1147 0.1061 0.1025 0.0983 0.0934 0.0881 0.0926 0.0996 0.0897 0.0947 0.0990 0.1188 0.1141 0.1123 0.1342 0.2874
va: 2.1225 2.0359 2.0613 3.7308 3.8117 3.8015 3.8980 3.9160 3.8991 4.2005 3.7484 3.7511 3.9249 3.9405 3.9105 3.7521 3.5118 4.0594 3.9383 3.8773 3.8247 3.5301 1.0222 1.0354 0.9998 0.9998 1.0200 0.9996 1.0017 1.0056 1.0119 1.0319 1.0274 1.0250 0.9966 1.0086 0.9955 0.9970 1.0118 0.9970 1.0030 1.0025 1.0017 1.0193 0.9880 0.9467
dispcorr: -0.021042496 hartree
energy: -964.194678816565
dipole: -30.80334 28.58938 -2.21396 6.42361 -5.67010 0.75351 -0.66829 0.26463 -0.40366
magnitude: 2.37326 au
magnitude: 6.03234 debye
