program: Orca
programVersion: 5.0.2
elementType: O O O C C C C C C C C C C C C C C C C C C C H H H H H H H H H H H H H H H H H H H H H H H H
charge: 0
multiplicity: 1
keywords: wb97x-d3
keywords: def2-TZVPP
keywords: def2/J RIJCOSX
keywords: DEFGRID2
keywords: scfconv7
keywords: smallprint printgap noloewdin
keywords: NOSOSCF
formula: C19H24O3
InChI: InChI=1/C19H24O3/c1-7-8-13-12(4)16(10-15(13)20)22-18(21)17-14(9-11(2)3)19(17,5)6/h1,9,14,16-17H,8,10H2,2-6H3
46 atoms
O  0.534235 -0.872939 -0.096914
O  -0.649536 -0.81998 1.806509
O  4.987254 -1.68959 -0.869127
C  -3.002483 -1.421967 -0.210783
C  -3.040219 0.018855 0.201126
C  -1.744163 -0.573529 -0.30908
C  -3.13797 -2.478329 0.857766
C  -3.621527 -1.828567 -1.525766
C  -3.715713 1.054892 -0.611057
C  -0.600482 -0.764307 0.601163
C  -4.735268 1.827222 -0.222821
C  1.773017 -1.097085 0.581044
C  -5.321318 2.847583 -1.152139
C  -5.387666 1.758065 1.123785
C  2.66218 -2.010023 -0.252134
C  2.546914 0.192204 0.708466
C  3.782476 0.0762 0.200669
C  3.967201 -1.26062 -0.375181
C  1.947074 1.382741 1.353964
C  4.861188 1.117534 0.178085
C  4.589659 2.166731 -0.797237
C  4.349632 3.033177 -1.594757
H  -3.068355 0.167331 1.275928
H  -1.463999 -0.304049 -1.321797
H  -2.588698 -3.383597 0.589701
H  -4.189122 -2.7543 0.964559
H  -2.789602 -2.15111 1.834939
H  -3.450508 -1.100873 -2.318294
H  -4.70128 -1.951756 -1.417377
H  -3.212578 -2.783116 -1.862865
H  -3.338013 1.189488 -1.620923
H  1.586484 -1.51604 1.572453
H  2.245828 -2.17087 -1.249496
H  2.815952 -2.990966 0.198541
H  -6.378495 2.644275 -1.343726
H  -5.275129 3.849273 -0.716074
H  -4.80544 2.876259 -2.112062
H  -5.322456 2.721348 1.637015
H  -6.453705 1.538282 1.0191
H  -4.96092 1.001122 1.779669
H  1.113527 1.763988 0.758698
H  2.663466 2.193383 1.473728
H  1.543539 1.129628 2.336159
H  4.976725 1.566427 1.168125
H  5.819133 0.647771 -0.057706
H  4.137883 3.806955 -2.297689
elementType: O C H
totalener: -964.17407043 hartree
nucrepener: 1739.94781036 hartree
electener: -2704.12188078 hartree
oneelecener: -4764.59165975 hartree
twoeener: 2060.46977897 hartree
cpcmener: -0.03146675 hartree
kineticenergy: 959.75917560 hartree
xcener: -94.693006218652 hartree
chargesum: 0.0000000
charge: -0.289543 -0.468078 -0.444498 0.127265 0.032191 -0.129552 -0.285746 -0.262089 -0.278622 0.395163 -0.038375 0.246828 -0.222939 -0.251631 -0.133427 -0.028747 -0.091928 0.288685 -0.244841 -0.104796 -0.458978 0.047119 0.094491 0.086762 0.099237 0.096365 0.092488 0.087547 0.096546 0.097059 0.118460 0.103809 0.101582 0.100029 0.093342 0.093161 0.088270 0.096092 0.095126 0.089596 0.115597 0.100506 0.118335 0.132929 0.111926 0.287286
qa: -0.2895 -0.4681 -0.4445 0.1273 0.0322 -0.1296 -0.2857 -0.2621 -0.2786 0.3952 -0.0384 0.2468 -0.2229 -0.2516 -0.1334 -0.0287 -0.0919 0.2887 -0.2448 -0.1048 -0.4590 0.0471 0.0945 0.0868 0.0992 0.0964 0.0925 0.0875 0.0965 0.0971 0.1185 0.1038 0.1016 0.1000 0.0933 0.0932 0.0883 0.0961 0.0951 0.0896 0.1156 0.1005 0.1183 0.1329 0.1119 0.2873
va: 2.1275 2.0378 2.0632 3.6828 3.7640 3.8935 3.9067 3.9056 3.8737 4.1771 3.7375 3.7549 3.9239 3.9440 3.9020 3.7441 3.5183 4.0602 3.9368 3.8818 3.8335 3.5334 1.0303 1.0409 0.9991 1.0006 1.0188 1.0048 1.0029 1.0027 1.0092 1.0311 1.0293 1.0237 0.9963 0.9960 1.0089 0.9972 0.9973 1.0092 0.9989 1.0034 1.0066 0.9886 1.0196 0.9468
dispcorr: -0.020940827 hartree
energy: -964.195011256438
dipole: -32.59847 30.66288 -1.93559 5.53449 -4.87283 0.66166 0.37615 -0.06716 0.30899
magnitude: 2.06876 au
magnitude: 5.25838 debye
