program: Orca
programVersion: 5.0.2
elementType: O O O C C C C C C C C C C C C C C C C C C C H H H H H H H H H H H H H H H H H H H H H H H H
charge: 0
multiplicity: 1
keywords: wb97x-d3
keywords: def2-TZVPP
keywords: def2/J RIJCOSX
keywords: DEFGRID2
keywords: scfconv7
keywords: smallprint printgap noloewdin
keywords: NOSOSCF
formula: C19H24O3
InChI: InChI=1/C19H24O3/c1-7-8-13-12(4)16(10-15(13)20)22-18(21)17-14(9-11(2)3)19(17,5)6/h1,9,14,16-17H,8,10H2,2-6H3
46 atoms
O  0.559335 -0.884327 -0.113278
O  -0.59836 -0.792041 1.803358
O  5.005848 -1.735788 -0.900728
C  -3.015995 -1.321424 -0.135082
C  -2.965227 0.131304 0.22496
C  -1.71814 -0.543034 -0.297606
C  -3.177553 -2.33678 0.968668
C  -3.697585 -1.724349 -1.419859
C  -3.622038 1.175095 -0.599458
C  -0.564676 -0.749832 0.596807
C  -4.775435 1.778383 -0.2984
C  1.800459 -1.121444 0.55637
C  -5.353575 2.834576 -1.190612
C  -5.583533 1.465213 0.923296
C  2.677498 -2.035484 -0.287817
C  2.585967 0.160468 0.690325
C  3.817181 0.038592 0.173145
C  3.988939 -1.297328 -0.408838
C  2.002791 1.349515 1.354457
C  4.905729 1.070249 0.153344
C  4.589935 2.18968 -0.725488
C  4.313255 3.112953 -1.44367
H  -2.951911 0.318908 1.294799
H  -1.451011 -0.32384 -1.325939
H  -2.673742 -3.27384 0.721959
H  -4.237781 -2.562239 1.101238
H  -2.797761 -1.993605 1.928415
H  -3.357035 -2.709422 -1.745265
H  -3.509764 -1.02536 -2.234479
H  -4.778953 -1.77967 -1.276411
H  -3.117371 1.460389 -1.518397
H  1.615856 -1.546475 1.545501
H  2.257385 -2.182732 -1.285688
H  2.82228 -3.021915 0.153717
H  -5.485061 3.776921 -0.651867
H  -4.724467 3.030146 -2.059159
H  -6.344586 2.545219 -1.550687
H  -5.161281 0.665301 1.529237
H  -5.688082 2.348553 1.559017
H  -6.597665 1.166736 0.644904
H  1.589888 1.085208 2.329555
H  1.179318 1.756541 0.762217
H  2.731966 2.145315 1.493976
H  5.088477 1.448144 1.163062
H  5.840986 0.608707 -0.172633
H  4.068767 3.931527 -2.082024
elementType: O C H
totalener: -964.17330357 hartree
nucrepener: 1742.01865996 hartree
electener: -2706.19196353 hartree
oneelecener: -4768.75166500 hartree
twoeener: 2062.55970147 hartree
cpcmener: -0.03071382 hartree
kineticenergy: 959.76394161 hartree
xcener: -94.693673711066 hartree
chargesum: 0.0000000
charge: -0.290888 -0.468697 -0.444500 0.148216 -0.008606 -0.129961 -0.298347 -0.265296 -0.262814 0.398339 -0.033419 0.249496 -0.228430 -0.250244 -0.132838 -0.026592 -0.090911 0.285813 -0.249101 -0.102001 -0.462420 0.048184 0.100145 0.088710 0.101152 0.095873 0.093956 0.097835 0.090422 0.095779 0.120797 0.103105 0.101885 0.100084 0.094009 0.088933 0.093599 0.087798 0.098523 0.094848 0.118783 0.116884 0.099949 0.133436 0.111037 0.287474
qa: -0.2909 -0.4687 -0.4445 0.1482 -0.0086 -0.1300 -0.2983 -0.2653 -0.2628 0.3983 -0.0334 0.2495 -0.2284 -0.2502 -0.1328 -0.0266 -0.0909 0.2858 -0.2491 -0.1020 -0.4624 0.0482 0.1001 0.0887 0.1012 0.0959 0.0940 0.0978 0.0904 0.0958 0.1208 0.1031 0.1019 0.1001 0.0940 0.0889 0.0936 0.0878 0.0985 0.0948 0.1188 0.1169 0.0999 0.1334 0.1110 0.2875
va: 2.1292 2.0362 2.0633 3.6682 3.7803 3.9146 3.9028 3.9062 3.8722 4.1770 3.7072 3.7547 3.9277 3.9425 3.9039 3.7368 3.5194 4.0589 3.9373 3.8813 3.8314 3.5315 1.0243 1.0394 0.9990 1.0008 1.0186 1.0031 1.0028 1.0029 1.0074 1.0308 1.0292 1.0237 0.9955 1.0079 0.9965 1.0084 0.9980 0.9977 1.0075 0.9980 1.0030 0.9880 1.0213 0.9467
dispcorr: -0.021322165 hartree
energy: -964.194625734114
dipole: -33.24828 31.26555 -1.98273 5.34360 -4.70351 0.64009 0.39487 -0.09978 0.29509
magnitude: 2.10428 au
magnitude: 5.34867 debye
