program: Orca
programVersion: 5.0.2
elementType: O O O C C C C C C C C C C C C C C C C C C C H H H H H H H H H H H H H H H H H H H H H H H H
charge: 0
multiplicity: 1
keywords: wb97x-d3
keywords: def2-TZVPP
keywords: def2/J RIJCOSX
keywords: DEFGRID2
keywords: scfconv7
keywords: smallprint printgap noloewdin
keywords: NOSOSCF
formula: C19H24O3
InChI: InChI=1/C19H24O3/c1-7-8-13-12(4)16(10-15(13)20)22-18(21)17-14(9-11(2)3)19(17,5)6/h1,9,14,16-17H,8,10H2,2-6H3
46 atoms
O  0.419274 -1.019259 -0.172518
O  -0.582927 -0.492502 1.761311
O  4.923022 -1.568171 -1.058063
C  -3.117065 -1.630016 0.286117
C  -3.131677 -0.133541 0.238023
C  -1.887274 -0.886837 -0.207448
C  -3.123132 -2.301621 1.637488
C  -3.860471 -2.422784 -0.762601
C  -3.906593 0.633785 -0.754633
C  -0.652649 -0.774887 0.588832
C  -4.573516 1.773392 -0.540173
C  1.727529 -0.90903 0.391907
C  -5.325165 2.439193 -1.654176
C  -4.659751 2.489183 0.773399
C  2.663656 -1.927467 -0.243669
C  2.336097 0.435061 0.070039
C  3.549683 0.301556 -0.48471
C  3.872839 -1.119935 -0.651956
C  1.635214 1.695148 0.411483
C  4.501065 1.391691 -0.881207
C  5.126277 2.036953 0.267006
C  5.621946 2.565029 1.226207
H  -3.026974 0.33151 1.212129
H  -1.723897 -0.946664 -1.277762
H  -2.577241 -3.24715 1.610444
H  -4.152138 -2.527454 1.924873
H  -2.694865 -1.687388 2.426243
H  -4.922818 -2.482474 -0.516974
H  -3.475195 -3.443249 -0.809557
H  -3.774454 -1.998147 -1.762017
H  -3.929835 0.224135 -1.76029
H  1.680268 -1.039479 1.47548
H  2.21785 -2.374466 -1.135958
H  2.939225 -2.741138 0.427277
H  -4.933952 3.441981 -1.847012
H  -5.273631 1.874211 -2.584907
H  -6.380039 2.566243 -1.395741
H  -5.689812 2.49477 1.140102
H  -4.036447 2.061364 1.556056
H  -4.370757 3.536958 0.658106
H  0.664029 1.75156 -0.085519
H  2.206185 2.576267 0.125349
H  1.444224 1.747005 1.485559
H  5.280805 0.980179 -1.526571
H  3.983291 2.148572 -1.475802
H  6.074273 3.014476 2.081973
elementType: O C H
totalener: -964.17431526 hartree
nucrepener: 1738.91687269 hartree
electener: -2703.09118795 hartree
oneelecener: -4762.43187129 hartree
twoeener: 2059.34068334 hartree
cpcmener: -0.03160708 hartree
kineticenergy: 959.75185453 hartree
xcener: -94.692830533083 hartree
chargesum: -0.0000000
charge: -0.290994 -0.467870 -0.444617 0.099239 0.034859 -0.089529 -0.274604 -0.273347 -0.271072 0.380306 -0.051485 0.251843 -0.216036 -0.252544 -0.136494 -0.034313 -0.089157 0.290512 -0.241173 -0.113604 -0.453207 0.047392 0.096314 0.086629 0.097791 0.095767 0.092098 0.098159 0.097076 0.088283 0.115454 0.105582 0.102073 0.098729 0.093568 0.087483 0.091885 0.098287 0.090568 0.092996 0.115070 0.099558 0.118418 0.113660 0.133859 0.286585
qa: -0.2910 -0.4679 -0.4446 0.0992 0.0349 -0.0895 -0.2746 -0.2733 -0.2711 0.3803 -0.0515 0.2518 -0.2160 -0.2525 -0.1365 -0.0343 -0.0892 0.2905 -0.2412 -0.1136 -0.4532 0.0474 0.0963 0.0866 0.0978 0.0958 0.0921 0.0982 0.0971 0.0883 0.1155 0.1056 0.1021 0.0987 0.0936 0.0875 0.0919 0.0983 0.0906 0.0930 0.1151 0.0996 0.1184 0.1137 0.1339 0.2866
va: 2.1258 2.0363 2.0616 3.7026 3.7787 3.8337 3.9048 3.9129 3.8784 4.1929 3.7697 3.7517 3.9202 3.9399 3.9099 3.7570 3.5113 4.0630 3.9377 3.8814 3.8272 3.5331 1.0282 1.0371 0.9995 0.9998 1.0196 1.0011 1.0017 1.0069 1.0125 1.0308 1.0281 1.0247 0.9966 1.0091 0.9960 0.9964 1.0111 0.9973 1.0012 1.0034 1.0029 1.0175 0.9882 0.9470
dispcorr: -0.020792119 hartree
energy: -964.195107379442
dipole: -32.49012 30.24727 -2.24285 5.75877 -5.06839 0.69038 -0.41522 0.07183 -0.34339
magnitude: 2.37169 au
magnitude: 6.02836 debye
