program: Orca
programVersion: 5.0.2
elementType: O O O C C C C C C C C C C C C C C C C C C C H H H H H H H H H H H H H H H H H H H H H H H H
charge: 0
multiplicity: 1
keywords: wb97x-d3
keywords: def2-TZVPP
keywords: def2/J RIJCOSX
keywords: DEFGRID2
keywords: scfconv7
keywords: smallprint printgap noloewdin
keywords: NOSOSCF
formula: C19H24O3
InChI: InChI=1/C19H24O3/c1-7-8-13-12(4)16(10-15(13)20)22-18(21)17-14(9-11(2)3)19(17,5)6/h1,9,14,16-17H,8,10H2,2-6H3
46 atoms
O  0.509277 -0.964734 -0.15257
O  -0.676482 -0.884897 1.746239
O  5.009701 -1.616381 -0.829748
C  -3.067503 -1.528978 -0.165069
C  -3.048201 -0.06123 0.13037
C  -1.783716 -0.741009 -0.369416
C  -3.201499 -2.496109 0.985812
C  -3.745477 -2.021307 -1.421705
C  -3.708558 0.943564 -0.7259
C  -0.630513 -0.869577 0.539099
C  -4.478141 1.940853 -0.279757
C  1.746294 -1.132332 0.5470
C  -5.078061 2.93756 -1.223617
C  -4.781307 2.154804 1.179779
C  2.684323 -2.018475 -0.260491
C  2.468687 0.186479 0.678864
C  3.715332 0.114242 0.190545
C  3.962319 -1.220643 -0.366079
C  1.817359 1.355414 1.314731
C  4.757453 1.192783 0.177977
C  4.409349 2.279439 -0.729331
C  4.089749 3.16254 -1.479102
H  -3.027783 0.175872 1.189386
H  -1.52129 -0.559111 -1.405863
H  -2.6736 -3.429228 0.776402
H  -4.254777 -2.743626 1.132646
H  -2.826818 -2.101762 1.92725
H  -3.393551 -3.022374 -1.678288
H  -3.56615 -1.381271 -2.284729
H  -4.825701 -2.080605 -1.271814
H  -3.535117 0.865198 -1.795084
H  1.558562 -1.54988 1.538541
H  2.294241 -2.207427 -1.263475
H  2.867208 -2.986972 0.206153
H  -4.797956 2.747534 -2.259889
H  -6.169708 2.930993 -1.161859
H  -4.762979 3.954075 -0.971372
H  -5.592333 2.871577 1.3119
H  -5.077664 1.234551 1.685196
H  -3.917199 2.552712 1.718366
H  0.980016 1.709455 0.707868
H  2.50314 2.18988 1.448114
H  1.408053 1.085857 2.290092
H  4.899822 1.595953 1.184428
H  5.719425 0.767262 -0.117967
H  3.818436 3.958119 -2.136049
elementType: O C H
totalener: -964.17291386 hartree
nucrepener: 1745.77976547 hartree
electener: -2709.95267932 hartree
oneelecener: -4776.29051058 hartree
twoeener: 2066.33783125 hartree
cpcmener: -0.03078636 hartree
kineticenergy: 959.75464860 hartree
xcener: -94.692369439710 hartree
chargesum: 0.0000000
charge: -0.292174 -0.471192 -0.444673 0.106179 0.051727 -0.112821 -0.281582 -0.269297 -0.304192 0.394134 -0.009717 0.251199 -0.221242 -0.286197 -0.132301 -0.027688 -0.090605 0.285481 -0.250547 -0.098069 -0.457413 0.040860 0.095106 0.087077 0.098296 0.095555 0.093401 0.096847 0.087532 0.097719 0.116476 0.103269 0.101722 0.100185 0.084757 0.094377 0.098253 0.095005 0.101992 0.105655 0.116590 0.100656 0.118649 0.133119 0.110492 0.287397
qa: -0.2922 -0.4712 -0.4447 0.1062 0.0517 -0.1128 -0.2816 -0.2693 -0.3042 0.3941 -0.0097 0.2512 -0.2212 -0.2862 -0.1323 -0.0277 -0.0906 0.2855 -0.2505 -0.0981 -0.4574 0.0409 0.0951 0.0871 0.0983 0.0956 0.0934 0.0968 0.0875 0.0977 0.1165 0.1033 0.1017 0.1002 0.0848 0.0944 0.0983 0.0950 0.1020 0.1057 0.1166 0.1007 0.1186 0.1331 0.1105 0.2874
va: 2.1296 2.0310 2.0631 3.6939 3.7599 3.8890 3.9062 3.9132 3.9035 4.1679 3.6967 3.7533 3.9233 3.9420 3.9031 3.7370 3.5199 4.0586 3.9380 3.8828 3.8296 3.5380 1.0280 1.0382 0.9991 1.0003 1.0199 1.0022 1.0062 1.0015 1.0108 1.0310 1.0292 1.0237 1.0102 0.9938 0.9926 1.0039 0.9966 0.9949 0.9983 1.0029 1.0074 0.9881 1.0219 0.9469
dispcorr: -0.020932867 hartree
energy: -964.193846723798
dipole: -31.48652 29.58257 -1.90395 6.01687 -5.38107 0.63580 0.90875 -0.59381 0.31493
magnitude: 2.03186 au
magnitude: 5.16457 debye
