program: Orca
programVersion: 5.0.2
elementType: O O O C C C C C C C C C C C C C C C C C C C H H H H H H H H H H H H H H H H H H H H H H H H
charge: 0
multiplicity: 1
keywords: wb97x-d3
keywords: def2-TZVPP
keywords: def2/J RIJCOSX
keywords: DEFGRID2
keywords: scfconv7
keywords: smallprint printgap noloewdin
keywords: NOSOSCF
formula: C19H24O3
InChI: InChI=1/C19H24O3/c1-7-8-13-12(4)16(10-15(13)20)22-18(21)17-14(9-11(2)3)19(17,5)6/h1,9,14,16-17H,8,10H2,2-6H3
46 atoms
O  0.516229 -1.002699 -0.151677
O  -0.662465 -0.922825 1.755032
O  5.047416 -1.673756 -0.734121
C  -3.068147 -1.532681 -0.163593
C  -3.027606 -0.070652 0.159531
C  -1.776933 -0.757065 -0.354705
C  -3.215655 -2.515618 0.972562
C  -3.756864 -1.991178 -1.427649
C  -3.68104 0.957964 -0.671999
C  -0.619984 -0.902497 0.552524
C  -4.470486 1.9459 -0.244622
C  1.752176 -1.14667 0.547319
C  -5.049296 2.937611 -1.209492
C  -4.85091 2.175442 1.186572
C  2.696739 -2.049686 -0.235286
C  2.470953 0.178187 0.644141
C  3.723538 0.093826 0.180015
C  3.991817 -1.264012 -0.325298
C  1.800869 1.366411 1.228701
C  4.773232 1.16429 0.145353
C  4.396256 2.296838 -0.690198
C  4.07591 3.229871 -1.373224
H  -2.989175 0.1389 1.222837
H  -1.509433 -0.562227 -1.387456
H  -2.750405 -3.471428 0.723174
H  -4.275109 -2.704909 1.154424
H  -2.776206 -2.1620 1.901472
H  -3.403911 -2.982263 -1.71707
H  -3.588462 -1.324923 -2.272379
H  -4.834952 -2.054072 -1.270385
H  -3.485248 0.903959 -1.738909
H  1.559894 -1.533839 1.551415
H  2.318352 -2.229524 -1.243763
H  2.859059 -3.022308 0.22925
H  -4.744955 3.956064 -0.9550
H  -4.73887 2.7436 -2.235439
H  -6.14173 2.92343 -1.180648
H  -4.478803 1.412912 1.866916
H  -4.480036 3.142757 1.535022
H  -5.938158 2.204692 1.291874
H  1.327409 1.117615 2.179289
H  1.009557 1.722438 0.565212
H  2.490483 2.193898 1.380299
H  4.986227 1.518239 1.15853
H  5.703962 0.730316 -0.2284
H  3.79494 4.051037 -1.986971
totalener: -964.15061350 hartree
nucrepener: 1744.70281079 hartree
electener: -2708.85342429 hartree
oneelecener: -4773.94353547 hartree
twoeener: 2065.09011117 hartree
kineticenergy: 959.81892401 hartree
xcener: -94.698151231511 hartree
chargesum: -0.0000000
charge: -0.275320 -0.393711 -0.329591 0.089545 0.045771 -0.105230 -0.259482 -0.243013 -0.193481 0.328673 -0.046771 0.221354 -0.203719 -0.238144 -0.133204 -0.046308 -0.060808 0.219077 -0.240304 -0.160498 -0.418434 0.097335 0.091278 0.073054 0.085094 0.086456 0.100292 0.091170 0.071668 0.093732 0.073235 0.096729 0.091187 0.087795 0.084625 0.077164 0.084943 0.083652 0.088750 0.084604 0.119577 0.104301 0.094350 0.118990 0.118889 0.244725
qa: -0.2753 -0.3937 -0.3296 0.0895 0.0458 -0.1052 -0.2595 -0.2430 -0.1935 0.3287 -0.0468 0.2214 -0.2037 -0.2381 -0.1332 -0.0463 -0.0608 0.2191 -0.2403 -0.1605 -0.4184 0.0973 0.0913 0.0731 0.0851 0.0865 0.1003 0.0912 0.0717 0.0937 0.0732 0.0967 0.0912 0.0878 0.0846 0.0772 0.0849 0.0837 0.0887 0.0846 0.1196 0.1043 0.0944 0.1190 0.1189 0.2447
va: 2.1232 2.1037 2.1733 3.7358 3.7729 3.8945 3.9141 3.9159 3.9033 4.2337 3.8170 3.7698 3.9351 3.9463 3.8749 3.7183 3.4865 4.1097 3.9478 3.9145 3.8646 3.5713 1.0352 1.0404 1.0026 1.0013 1.0214 1.0047 1.0105 1.0040 1.0216 1.0304 1.0318 1.0279 0.9979 1.0122 0.9985 1.0145 0.9985 1.0000 1.0085 1.0020 1.0049 0.9853 1.0200 0.9732
dispcorr: -0.020847602 hartree
energy: -964.171461103703
dipole: -31.75471 30.25521 -1.49950 6.34765 -5.81777 0.52988 0.41063 -0.28253 0.12809
magnitude: 1.59552 au
magnitude: 4.05548 debye
