program: Orca
programVersion: 5.0.2
elementType: O O O C C C C C C C C C C C C C C C C C C C H H H H H H H H H H H H H H H H H H H H H H H H
charge: 0
multiplicity: 1
keywords: wb97x-d3
keywords: def2-TZVPP
keywords: def2/J RIJCOSX
keywords: DEFGRID2
keywords: scfconv7
keywords: smallprint printgap noloewdin
keywords: NOSOSCF
formula: C19H24O3
InChI: InChI=1/C19H24O3/c1-7-8-13-12(4)16(10-15(13)20)22-18(21)17-14(9-11(2)3)19(17,5)6/h1,9,14,16-17H,8,10H2,2-6H3
46 atoms
O  0.14152 -0.850025 -0.271696
O  -0.357463 -2.747274 0.809966
O  3.96366 0.389753 -2.498809
C  -2.232112 0.272369 1.381582
C  -2.569189 0.119822 -0.073775
C  -2.003573 -1.058036 0.687446
C  -1.07286 1.159244 1.768406
C  -3.348612 0.303906 2.397804
C  -3.961616 0.057047 -0.564762
C  -0.671855 -1.650994 0.430325
C  -4.519654 0.854226 -1.478403
C  1.456563 -1.306333 -0.590343
C  -5.945874 0.661936 -1.90045
C  -3.817138 1.988297 -2.160941
C  1.885575 -0.742724 -1.939307
C  2.466527 -0.7707 0.397099
C  3.447878 -0.098571 -0.216797
C  3.220503 -0.072853 -1.672327
C  2.327277 -1.031673 1.85192
C  4.643289 0.561413 0.403533
C  4.275553 1.61514 1.340178
C  3.954732 2.471512 2.116697
H  -1.86385 0.60106 -0.741291
H  -2.714011 -1.828774 0.96685
H  -0.606047 0.80875 2.69184
H  -1.433726 2.172484 1.953699
H  -0.302802 1.222837 1.003573
H  -2.974163 0.030766 3.385802
H  -4.162797 -0.377548 2.156018
H  -3.772478 1.307223 2.466159
H  -4.582236 -0.726241 -0.139072
H  1.472004 -2.399233 -0.580323
H  1.174456 0.003138 -2.300008
H  1.978629 -1.501047 -2.71689
H  -6.419677 -0.171267 -1.3828
H  -6.538621 1.559219 -1.706142
H  -6.014928 0.471001 -2.974366
H  -4.355317 2.92463 -1.994994
H  -2.794419 2.137399 -1.822293
H  -3.792649 1.833938 -3.242576
H  2.086973 -2.078758 2.037463
H  1.50923 -0.440555 2.269705
H  3.227089 -0.768413 2.403583
H  5.261513 -0.180156 0.918482
H  5.266581 0.978822 -0.391111
H  3.674052 3.238253 2.797236
totalener: -964.14720295 hartree
nucrepener: 1784.05652687 hartree
electener: -2748.20372981 hartree
oneelecener: -4852.43552698 hartree
twoeener: 2104.23179716 hartree
kineticenergy: 959.82123228 hartree
xcener: -94.698487082381 hartree
chargesum: -0.0000000
charge: -0.275693 -0.363818 -0.328777 0.122436 0.075761 -0.126466 -0.305726 -0.240818 -0.214649 0.333590 -0.040912 0.177322 -0.205182 -0.240673 -0.130715 -0.043363 -0.059328 0.218862 -0.242695 -0.157144 -0.410628 0.086227 0.083244 0.077430 0.091943 0.095059 0.094828 0.093114 0.073104 0.090437 0.076403 0.104175 0.089585 0.090066 0.077389 0.084027 0.085767 0.086162 0.080439 0.089951 0.123890 0.105439 0.096225 0.119246 0.119765 0.244701
qa: -0.2757 -0.3638 -0.3288 0.1224 0.0758 -0.1265 -0.3057 -0.2408 -0.2146 0.3336 -0.0409 0.1773 -0.2052 -0.2407 -0.1307 -0.0434 -0.0593 0.2189 -0.2427 -0.1571 -0.4106 0.0862 0.0832 0.0774 0.0919 0.0951 0.0948 0.0931 0.0731 0.0904 0.0764 0.1042 0.0896 0.0901 0.0774 0.0840 0.0858 0.0862 0.0804 0.0900 0.1239 0.1054 0.0962 0.1192 0.1198 0.2447
va: 2.0854 2.1358 2.1746 3.6714 3.7319 3.9149 3.9153 3.9175 3.9040 4.2627 3.8035 3.7922 3.9384 3.9499 3.8804 3.6728 3.4706 4.1110 3.9543 3.9175 3.8598 3.5838 1.0261 1.0373 0.9976 1.0073 1.0142 1.0039 1.0112 1.0048 1.0201 1.0288 1.0297 1.0282 1.0121 0.9987 0.9981 1.0003 1.0132 0.9986 1.0111 0.9981 1.0040 0.9855 1.0195 0.9735
dispcorr: -0.022625867 hartree
energy: -964.169828814413
dipole: -25.23286 24.17530 -1.05756 8.40494 -8.10695 0.29799 4.72500 -4.06355 0.66145
magnitude: 1.28248 au
magnitude: 3.25980 debye
