program: Orca
programVersion: 5.0.2
elementType: O O O C C C C C C C C C C C C C C C C C C C H H H H H H H H H H H H H H H H H H H H H H H H
charge: 0
multiplicity: 1
keywords: wb97x-d3
keywords: def2-TZVPP
keywords: def2/J RIJCOSX
keywords: DEFGRID2
keywords: scfconv7
keywords: smallprint printgap noloewdin
keywords: NOSOSCF
formula: C19H24O3
InChI: InChI=1/C19H24O3/c1-7-8-13-12(4)16(10-15(13)20)22-18(21)17-14(9-11(2)3)19(17,5)6/h1,9,14,16-17H,8,10H2,2-6H3
46 atoms
O  0.439005 -0.966051 -0.224286
O  -0.557152 -0.401091 1.703882
O  4.891441 -1.697734 -1.134305
C  -3.089654 -1.558898 0.250903
C  -3.106165 -0.061398 0.204884
C  -1.86998 -0.807907 -0.253759
C  -3.073584 -2.235397 1.59995
C  -3.860995 -2.338677 -0.787393
C  -3.897355 0.702833 -0.778091
C  -0.628693 -0.696495 0.539698
C  -4.72322 1.719698 -0.521354
C  1.738415 -0.919002 0.364492
C  -5.455124 2.411386 -1.632876
C  -5.011063 2.261677 0.845658
C  2.637376 -1.973638 -0.268146
C  2.418243 0.399132 0.076636
C  3.6293 0.219156 -0.465533
C  3.882156 -1.215605 -0.688926
C  1.761221 1.682595 0.430094
C  4.65331 1.253131 -0.83114
C  5.059359 2.082525 0.295966
C  5.384653 2.774314 1.220671
H  -2.985439 0.405271 1.176366
H  -1.709608 -0.865443 -1.324837
H  -2.563377 -1.652406 2.362264
H  -2.586795 -3.211027 1.540545
H  -4.098682 -2.401045 1.936181
H  -3.473999 -3.355806 -0.866442
H  -3.813284 -1.89272 -1.779758
H  -4.91399 -2.403025 -0.508132
H  -3.784598 0.404829 -1.816426
H  1.65326 -1.054035 1.446016
H  2.168124 -2.414216 -1.150015
H  2.890303 -2.791735 0.406464
H  -5.207112 3.475389 -1.663856
H  -5.220266 1.985712 -2.607669
H  -6.536938 2.348484 -1.491269
H  -6.074531 2.164328 1.077934
H  -4.457696 1.766107 1.63992
H  -4.780128 3.328466 0.895179
H  1.459457 1.683733 1.478528
H  0.850963 1.822348 -0.157004
H  2.410251 2.537996 0.259502
H  5.531101 0.743925 -1.23691
H  4.274916 1.89303 -1.633922
H  5.678937 3.379335 2.043709
totalener: -964.15067167 hartree
nucrepener: 1737.95831759 hartree
electener: -2702.10898925 hartree
oneelecener: -4760.43851704 hartree
twoeener: 2058.32952779 hartree
kineticenergy: 959.82031639 hartree
xcener: -94.698865572007 hartree
chargesum: -0.0000000
charge: -0.275671 -0.390624 -0.330490 0.088438 0.045613 -0.106553 -0.259968 -0.241661 -0.192438 0.324432 -0.050254 0.229036 -0.202174 -0.235880 -0.138995 -0.059020 -0.063150 0.222715 -0.232285 -0.153533 -0.426147 0.103193 0.092043 0.071491 0.101601 0.084486 0.087094 0.091456 0.071152 0.093838 0.073027 0.099468 0.090470 0.087937 0.084949 0.077037 0.084203 0.087014 0.082923 0.086342 0.115718 0.102530 0.095939 0.119130 0.120215 0.245354
qa: -0.2757 -0.3906 -0.3305 0.0884 0.0456 -0.1066 -0.2600 -0.2417 -0.1924 0.3244 -0.0503 0.2290 -0.2022 -0.2359 -0.1390 -0.0590 -0.0631 0.2227 -0.2323 -0.1535 -0.4261 0.1032 0.0920 0.0715 0.1016 0.0845 0.0871 0.0915 0.0712 0.0938 0.0730 0.0995 0.0905 0.0879 0.0849 0.0770 0.0842 0.0870 0.0829 0.0863 0.1157 0.1025 0.0959 0.1191 0.1202 0.2454
va: 2.1218 2.1057 2.1725 3.7409 3.7700 3.8942 3.9139 3.9143 3.8966 4.2427 3.8237 3.7465 3.9343 3.9458 3.8786 3.7328 3.4951 4.1072 3.9425 3.8987 3.8707 3.5622 1.0350 1.0407 1.0211 1.0027 1.0013 1.0048 1.0106 1.0039 1.0212 1.0292 1.0318 1.0283 0.9985 1.0122 0.9985 0.9992 1.0154 0.9993 1.0075 1.0036 1.0094 1.0196 0.9852 0.9728
dispcorr: -0.020805864 hartree
energy: -964.171477529832
dipole: -32.89683 31.27747 -1.61936 5.38666 -4.88229 0.50436 -0.02778 -0.08580 -0.11358
magnitude: 1.69989 au
magnitude: 4.32076 debye
