program: Gaussian 09
title: 000067822
version: EM64L-G09RevD.01
frameworkgroup: C1[X(C14HF27O2)]
method: RPBEPBE
basis: SDD
operation: Freq
keyword: #p
keyword: freq=noraman
keyword: PBEPBE/SDD
title: #p freq=noraman PBEPBE/SDD
converged: YES YES NO NO
title: Mulliken charges:
elementType: F F F F F F F F F F F F F F F F F F F F F F F F F F F O O C C C C C C C C C C C C C C H
charge: -0.119356 -0.117912 -0.118615 -0.118711 -0.117358 -0.119207 -0.119858 -0.114006 -0.117492 -0.120764 -0.114127 -0.121789 -0.123367 -0.116553 -0.136435 -0.116698 -0.121080 -0.116695 -0.126839 -0.118260 -0.122091 -0.121174 -0.130966 -0.136788 -0.121925 -0.119892 -0.125986 -0.375361 -0.156450 0.237671 0.236801 0.238978 0.239484 0.240195 0.242759 0.243780 0.239228 0.255920 0.258606 0.207515 0.238230 0.373829 0.142258 0.410498
chargesum: 0.00000
title: Mulliken charges with hydrogens summed into heavy atoms:
elementType: F F F F F F F F F F F F F F F F F F F F F F F F F F F O O C C C C C C C C C C C C C C
charge: -0.119356 -0.117912 -0.118615 -0.118711 -0.117358 -0.119207 -0.119858 -0.114006 -0.117492 -0.120764 -0.114127 -0.121789 -0.123367 -0.116553 -0.136435 -0.116698 -0.121080 -0.116695 -0.126839 -0.118260 -0.122091 -0.121174 -0.130966 -0.136788 -0.121925 -0.119892 -0.125986 0.035137 -0.156450 0.237671 0.236801 0.238978 0.239484 0.240195 0.242759 0.243780 0.239228 0.255920 0.258606 0.207515 0.238230 0.373829 0.142258
polarizability: 2.06030123e+02 -1.97665210e+00 1.59273702e+02 -5.83834476e+00 -1.55371718e-01 1.51731344e+02
1716.lowfreq: -5.8685 -3.1726 0.0001 0.0007 0.0008 4.0055 16.0629 18.1354 27.0083
frequency: 15.9631 18.0946 27.0017 31.0608 33.9238 38.8635 45.8807 51.4941 52.1269 57.9963 63.6945 85.2534 96.9225 108.4074 117.0784 121.3041 122.1286 128.7501 131.9000 133.9038 135.4904 146.1976 157.5016 167.6138 175.3324 185.0987 198.6474 211.3760 224.4458 230.7741 234.2113 240.1764 245.0281 246.9481 251.2858 252.1044 259.0009 266.8457 274.3576 278.0575 281.4780 282.6447 288.5452 290.2603 297.6842 298.7290 300.4659 305.4865 308.0318 312.1406 317.5556 330.3137 332.9098 339.0824 342.7477 356.1449 379.2715 397.6116 409.3062 416.4871 423.0033 431.7012 444.2675 456.3646 459.9114 464.3853 513.9710 523.8942 540.3856 542.2698 552.3493 557.9061 567.6140 572.6258 579.5296 582.4375 587.1213 590.7768 593.4561 594.3238 640.0423 654.2487 708.0725 785.9844 814.9833 840.6839 865.3272 892.3792 922.8888 953.8519 974.0349 979.3360 985.9519 990.3773 995.4883 998.9955 1015.9418 1019.7171 1026.9327 1028.2186 1036.0122 1038.2188 1041.4591 1042.5482 1048.5141 1050.6443 1063.4360 1066.5046 1079.3429 1085.8033 1100.9834 1106.5675 1107.1487 1114.8688 1122.6198 1129.6093 1132.6977 1135.1466 1137.9909 1143.5859 1152.1990 1156.5476 1189.6184 1311.3439 1686.5374 3525.4977
redmass: 14.8209 15.5945 14.6712 16.8717 16.2673 13.8413 17.1151 14.6335 17.7070 15.9102 17.2606 17.7361 15.7502 17.4716 15.8959 17.6153 17.9251 18.1286 17.2422 17.8172 18.0824 15.7459 15.5557 16.1127 17.1778 16.9332 17.5676 17.4816 17.5003 12.4247 18.1841 18.3474 18.1271 18.5505 18.3476 17.6512 17.3453 17.2157 17.6889 17.9266 18.6142 18.5867 18.6826 18.3424 18.6522 18.7570 18.5499 18.8046 18.8608 18.5543 18.6517 18.6041 15.9293 18.0904 15.0568 15.7086 15.5525 16.2628 17.2184 17.5510 17.6532 17.3755 16.9251 11.2486 12.2121 17.2319 17.6171 4.9088 14.5593 15.3777 12.5241 15.5629 12.1574 16.4060 16.5190 8.9033 14.1701 3.5592 7.5669 5.4663 4.1472 17.1488 7.5598 13.1349 13.2924 13.4239 13.4308 13.3492 13.3462 13.4683 13.7341 13.7537 13.6159 13.2107 13.2040 13.2267 13.0815 5.8979 10.3101 11.0317 12.6888 10.1933 12.9903 12.6515 11.8310 12.8103 12.7998 12.5272 13.1898 13.2028 13.0062 4.1150 12.1139 12.6028 12.3403 11.8866 12.0542 11.3376 11.4302 11.9697 12.0516 12.0330 12.3424 2.5223 11.6593 1.0649
irintensity: 0.2434 0.0852 0.5474 0.1339 0.2419 1.2772 0.0271 1.2492 0.0075 0.0401 0.1200 0.1448 0.7384 0.2750 0.5046 0.4757 1.2566 0.5294 0.2087 0.6489 0.8409 1.0459 0.6047 0.1508 3.5038 64.9976 3.7582 0.8441 0.8786 1.1421 0.1669 1.3155 0.1590 1.3805 0.5019 0.3042 0.3487 0.0727 0.1956 0.3082 1.5285 1.9226 0.3812 0.0494 0.0544 0.0044 0.0566 0.0296 0.0124 0.2314 0.3896 0.8550 0.5733 0.2057 1.1893 1.9810 0.1065 11.7008 17.4650 3.0824 0.5763 0.9002 0.5767 3.3529 1.0787 5.5714 1.3224 16.2156 2.0119 1.8808 25.9210 6.0177 35.3355 4.0732 0.7604 6.8834 2.6059 45.8346 13.1119 22.4190 162.1015 42.5625 27.5268 666.8915 0.0305 49.7787 0.4234 93.9422 123.6356 71.1863 9.4140 15.2177 2.7567 0.8366 72.6761 463.3193 19.1995 44.3758 33.0076 65.3316 15.5944 61.0899 18.0522 25.1716 189.2309 126.3741 225.7704 316.3678 260.5375 333.9750 2.5461 11.0284 0.2478 5.4255 13.3657 63.2597 19.6307 12.8055 8.2132 7.7587 0.8353 0.7123 46.7853 19.9957 204.0704 73.6475
temp: 298.150 k
press: 1.00000 atm
elementType: 9 9 9 9 9 9 9 9 9 9 9 9 9 9 9 9 9 9 9 9 9 9 9 9 9 9 9 8 8 6 6 6 6 6 6 6 6 6 6 6 6 6 6 1
symmnumber: 1
zpe: 436196.3 jmol-1
zpe.correction: 0.166138 hartree
zpe.thermalcorrener: 0.209095 hartree
zpe.thermalcorrenthalpy: 0.210040 hartree
zpe.thermalcorrgfe: 0.088850 hartree
zpe.sumelectzpe: -3376.823611 hartree
zpe.sumelectthermal: -3376.780654 hartree
zpe.sumelectthermalent: -3376.779710 hartree
zpe.sumelectthermalfe: -3376.900899 hartree
dipole: 2.2204 -0.6676 -1.8157
dipole: 2.9449
quadrupole: -214.4296 -249.9824 -243.3918
quadrupole: -6.1301 -15.8278 3.2960
quadrupole: 21.5050 -14.0478 -7.4572 -6.1301 -15.8278 3.2960
hfenergy: -3376.9897494 hartree
pointgroup: C01 [X(C14H1F27O2)]
dipole: 0.8788028 -0.4352476 -0.6169846 debye
polarizability: 206.1113234|-3.1308103|158.6349239|-4.8892691|-2.0872627|152.2889211 unknown
InChI: InChI=1S/C14HF27O2/c15-2(16,1(42)43)3(17,18)4(19,20)5(21,22)6(23,24)7(25,26)8(27,28)9(29,30)10(31,32)11(33,34)12(35,36)13(37,38)14(39,40)41/h42H
charge 0 multiplicity 1
44 atoms
F  -1.078113 1.749218 -1.003674
F  0.33283 0.23791 -1.961768
F  1.447435 1.998664 -0.185348
F  0.017208 1.361027 1.472011
F  -0.730758 -1.825496 -0.491892
F  -2.176908 -0.636035 -1.789428
F  1.046346 -1.200752 1.481978
F  2.496452 0.509033 1.883595
F  -1.743527 -0.720778 1.810591
F  -3.217898 -1.809257 0.453651
F  3.55547 -1.743339 0.732704
F  2.089388 -1.639306 -1.011043
F  -4.24499 0.196978 2.003895
F  -2.792371 1.726968 1.135247
F  4.61686 -1.034586 -1.64984
F  3.165403 0.713544 -1.898989
F  -3.903067 1.433162 -1.389922
F  -5.295977 2.059366 0.303523
F  4.269582 1.953545 0.390833
F  5.64335 1.499116 -1.367965
F  -6.478743 0.667876 -1.683134
F  -5.033315 -1.089144 -1.49544
F  5.35867 -0.045929 1.899441
F  6.928275 1.33671 0.99644
F  -7.237722 0.214608 1.105953
F  -7.686772 -1.372192 -0.451353
F  -6.008878 -1.69649 1.031781
O  7.632255 -0.567713 -0.843276
O  6.71901 -2.08087 0.690508
C  -0.363563 0.549879 -0.771717
C  0.717402 0.902365 0.332365
C  -1.434527 -0.602957 -0.585287
C  1.771426 -0.152503 0.86741
C  -2.476819 -0.612902 0.606993
C  2.821169 -0.854606 -0.086851
C  -3.521587 0.555061 0.837719
C  3.874622 -0.042073 -0.944011
C  -4.593939 0.962655 -0.25062
C  4.946242 0.913313 -0.287123
C  -5.679018 -0.062258 -0.77376
C  6.013365 0.292687 0.696548
C  -6.663515 -0.734962 0.256168
C  6.811723 -0.950594 0.19485
H  8.165824 -1.336638 -1.182763
