program: Orca
programVersion: 5.0.2
elementType: O O O C C C C C C C C C C C C C C C C C C C H H H H H H H H H H H H H H H H H H H H H H H H
charge: 0
multiplicity: 1
keywords: wb97x-d3
keywords: def2-TZVPP
keywords: def2/J RIJCOSX
keywords: DEFGRID2
keywords: scfconv7
keywords: smallprint printgap noloewdin
keywords: NOSOSCF
formula: C19H24O3
InChI: InChI=1/C19H24O3/c1-7-8-13-12(4)16(10-15(13)20)22-18(21)17-14(9-11(2)3)19(17,5)6/h1,9,14,16-17H,8,10H2,2-6H3
46 atoms
O  0.270993 -1.037836 -0.176477
O  -0.672165 -0.717046 1.833578
O  4.771475 -1.462837 -1.167881
C  -3.228006 -1.793435 0.339652
C  -3.283357 -0.313727 0.493086
C  -2.043535 -0.951707 -0.109311
C  -3.132185 -2.653131 1.576373
C  -4.010568 -2.444028 -0.776513
C  -4.158082 0.551037 -0.33778
C  -0.77794 -0.891875 0.64732
C  -3.910556 1.829997 -0.624189
C  1.586867 -0.931864 0.363296
C  -4.859207 2.647137 -1.446284
C  -2.684638 2.553348 -0.157115
C  2.53232 -1.905384 -0.327979
C  2.166641 0.435437 0.08907
C  3.37977 0.351492 -0.470543
C  3.729003 -1.058954 -0.721227
C  1.421609 1.660767 0.472319
C  4.324455 1.462317 -0.823885
C  4.685337 2.292204 0.318253
C  4.972756 2.975106 1.26224
H  -3.127147 0.031358 1.51211
H  -1.929085 -0.86038 -1.183221
H  -4.135642 -2.897653 1.929587
H  -2.603743 -2.165419 2.391564
H  -2.622818 -3.593812 1.358997
H  -5.043077 -2.622267 -0.46895
H  -3.573726 -3.409331 -1.03648
H  -4.033919 -1.838403 -1.682327
H  -5.07703 0.108773 -0.711016
H  1.553418 -1.100609 1.442777
H  2.075696 -2.320461 -1.229086
H  2.834611 -2.74416 0.298969
H  -4.366211 3.0396 -2.339206
H  -5.725837 2.070689 -1.767364
H  -5.220434 3.512501 -0.885163
H  -2.104303 2.92025 -1.007968
H  -2.956141 3.432709 0.432092
H  -2.030617 1.93518 0.454751
H  0.496717 1.740776 -0.103778
H  2.002233 2.565461 0.309588
H  1.134358 1.622865 1.524532
H  5.229696 1.025702 -1.253062
H  3.890464 2.093425 -1.605094
H  5.231283 3.568681 2.105452
totalener: -964.14947081 hartree
nucrepener: 1768.93173143 hartree
electener: -2733.08120223 hartree
oneelecener: -4822.32020515 hartree
twoeener: 2089.23900292 hartree
kineticenergy: 959.82067394 hartree
xcener: -94.698663948872 hartree
chargesum: 0.0000000
charge: -0.273503 -0.387144 -0.329907 0.131097 -0.028669 -0.087936 -0.255029 -0.278504 -0.238127 0.298308 0.008050 0.220973 -0.211628 -0.233227 -0.141209 -0.033316 -0.064663 0.225594 -0.249915 -0.155363 -0.423727 0.100213 0.107220 0.082206 0.085504 0.100937 0.086436 0.093872 0.092550 0.083443 0.094539 0.103349 0.090178 0.088150 0.085047 0.079524 0.087697 0.089656 0.094996 0.065728 0.094706 0.098348 0.119066 0.118346 0.120613 0.245518
qa: -0.2735 -0.3871 -0.3299 0.1311 -0.0287 -0.0879 -0.2550 -0.2785 -0.2381 0.2983 0.0080 0.2210 -0.2116 -0.2332 -0.1412 -0.0333 -0.0647 0.2256 -0.2499 -0.1554 -0.4237 0.1002 0.1072 0.0822 0.0855 0.1009 0.0864 0.0939 0.0925 0.0834 0.0945 0.1033 0.0902 0.0881 0.0850 0.0795 0.0877 0.0897 0.0950 0.0657 0.0947 0.0983 0.1191 0.1183 0.1206 0.2455
va: 2.1158 2.1060 2.1724 3.7494 3.8233 3.7983 3.8991 3.9129 3.9067 4.2398 3.7146 3.7648 3.9424 3.9494 3.8840 3.6691 3.5060 4.1068 3.9331 3.9013 3.8705 3.5663 1.0258 1.0357 1.0023 1.0200 1.0022 1.0001 1.0066 1.0042 1.0097 1.0299 1.0308 1.0288 0.9987 1.0097 0.9984 0.9980 1.0031 1.0175 1.0066 1.0135 1.0056 1.0196 0.9847 0.9727
dispcorr: -0.022289786 hartree
energy: -964.171760592099
dipole: -28.18094 26.63972 -1.54122 5.65204 -5.09880 0.55323 -1.67453 1.44776 -0.22677
magnitude: 1.65313 au
magnitude: 4.20193 debye
